Status of Lorry Controller

New jobs are allowed.

Maximum number of jobs: unlimited.

Free disk space: 15 GiB.

Upstream Hosts

Host Due for re-scan of remote repositories

Currently running jobs

Job ID path
392103 delta/nss-hg

Run-queue

Pos Path Interval Due Last run exit Job?
1 delta/nss-hg 3 h now 0
2 delta/elementary-xfce 3 h now 0
3 delta/bison 3 h now 0
4 delta/buildstream 3 h in 2 s 0
5 delta/enlightenment/eterm 3 h in 35 s 0
6 delta/erlang-modules/rebar 3 h in 36 s 0
7 delta/file-git 3 h in 38 s 0
8 delta/gmp 3 h in 2 min 43 s
1: Show log

INFO lorry version 0.0 starts
DEBUG sys.argv: ['/usr/bin/lorry', '--config=/etc/lorry-controller/lorry.conf', '--config=/etc/lc-site/lorry-controller/lorry.conf', '/tmp/tmpn50b9kfz']
DEBUG current working directory: /
DEBUG uid: 998
DEBUG effective uid: 998
DEBUG gid: 998
DEBUG effective gid: 998
DEBUG environment variables:
DEBUG environment: LANG=C.UTF-8
DEBUG environment: PATH=/usr/local/bin:/usr/bin
DEBUG environment: HOME=/srv/lorry
DEBUG environment: LOGNAME=lorry
DEBUG environment: USER=lorry
DEBUG environment: INVOCATION_ID=a94e6dd68c25466c9a694360b5c664ca
DEBUG environment: JOURNAL_STREAM=9:332723
DEBUG Config:
[config]
output = 
log = stderr
log-level = debug
log-max = 0
log-keep = 10
log-mode = 0600
dump-memory-profile = simple
memory-dump-interval = 300
working-area = /srv/lorry-working-area
mirror-base-url-push = /srv/lorry-depot
mirror-base-url-fetch = /srv/lorry-depot
pull-only = False
verbose = True
repack = True
command-stdout = None
command-stderr = None
bundle = never
bundle-dest = 
tarball = never
tarball-dest = 
keep-multiple-backups = False
push-option = 
bazaar-command = None
check-certificates = True


DEBUG Python version: 3.8.3 (default, Nov 10 2011, 15:00:00) 
[GCC 10.1.0]
DEBUG Processing spec file /tmp/tmpn50b9kfz
DEBUG Getting: delta/gmp
DEBUG Getting delta/gmp
DEBUG .. updating hg branch
DEBUG Running: argv=['hg', 'pull', '--quiet', 'https://gmplib.org/repo/gmp'] kwargs={'cwd': '/srv/lorry-working-area/delta_gmp/hg', 'stdin': <_io.TextIOWrapper name='/dev/null' mode='r' encoding='UTF-8'>}
DEBUG run external command: [['hg', 'pull', '--quiet', 'https://gmplib.org/repo/gmp']]
DEBUG Command: ['hg', 'pull', '--quiet', 'https://gmplib.org/repo/gmp']
Exit: 255
Stdout:
Stderr:
    abort: HTTP Error 500: Internal Server Error

DEBUG Mirror of delta/gmp failed, state before mirror is saved at /srv/lorry-working-area/delta_gmp/git-a and state after mirror is saved at /srv/lorry-working-area/delta_gmp/git-post-fail

Error mirroring:
Traceback (most recent call last):
  File "/usr/bin/lorry", line 262, in process_args
    self.gitify(name, specs[name])
  File "/usr/bin/lorry", line 375, in gitify
    table[vcstype](name, dirname, temp_repo, spec)
  File "/usr/bin/lorry", line 753, in gitify_hg
    self.run_program(
  File "/usr/bin/lorry", line 868, in run_program
    raise Exception('%s failed (exit code %s):\n%s' %
Exception: hg pull --quiet https://gmplib.org/repo/gmp failed (exit code 255):
    abort: HTTP Error 500: Internal Server Error

ERROR Traceback (most recent call last):
  File "/usr/bin/lorry", line 262, in process_args
    self.gitify(name, specs[name])
  File "/usr/bin/lorry", line 375, in gitify
    table[vcstype](name, dirname, temp_repo, spec)
  File "/usr/bin/lorry", line 753, in gitify_hg
    self.run_program(
  File "/usr/bin/lorry", line 868, in run_program
    raise Exception('%s failed (exit code %s):\n%s' %
Exception: hg pull --quiet https://gmplib.org/repo/gmp failed (exit code 255):
    abort: HTTP Error 500: Internal Server Error


DEBUG Total Mirrors failed: 1
DEBUG Done
Processing spec file /tmp/tmpn50b9kfz
Getting: delta/gmp
Getting delta/gmp
.. updating hg branch
Mirror of delta/gmp failed, state before mirror is saved at /srv/lorry-working-area/delta_gmp/git-a and state after mirror is saved at /srv/lorry-working-area/delta_gmp/git-post-fail
Done

9 delta/enlightenment/libast 3 h in 3 min 8 s 0
10 delta/flex-git 3 h in 3 min 9 s 0
11 delta/genivi/browser-poc 3 h in 3 min 10 s 0
12 delta/dbus 3 h in 3 min 12 s 0
13 delta/enlightenment/emotion_generic_players 3 h in 3 min 15 s 0
14 delta/enlightenment/evas_generic_loaders 3 h in 3 min 17 s 0
15 delta/flashrom-git 3 h in 3 min 17 s 0
16 delta/cloud-init-git 3 h in 3 min 20 s 0
17 baserock/baserock/fhs-dirs 10 min in 4 min 17 s 0
18 baserock/baserock/lorry 10 min in 4 min 20 s 0
19 baserock/baserock/lorry-controller 10 min in 4 min 59 s 0
20 delta/fuse 3 h in 5 min 1 s 0
21 baserock/baserock/definitions 10 min in 5 min 1 s 0
22 delta/genivi-common-api-dbus-runtime 3 h in 5 min 2 s 0
23 delta/desktop-file-utils 3 h in 5 min 3 s 0
24 delta/gdbm 3 h in 5 min 3 s
1: Show log

INFO lorry version 0.0 starts
DEBUG sys.argv: ['/usr/bin/lorry', '--config=/etc/lorry-controller/lorry.conf', '--config=/etc/lc-site/lorry-controller/lorry.conf', '/tmp/tmpd2bskdt1']
DEBUG current working directory: /
DEBUG uid: 998
DEBUG effective uid: 998
DEBUG gid: 998
DEBUG effective gid: 998
DEBUG environment variables:
DEBUG environment: LANG=C.UTF-8
DEBUG environment: PATH=/usr/local/bin:/usr/bin
DEBUG environment: HOME=/srv/lorry
DEBUG environment: LOGNAME=lorry
DEBUG environment: USER=lorry
DEBUG environment: INVOCATION_ID=a94e6dd68c25466c9a694360b5c664ca
DEBUG environment: JOURNAL_STREAM=9:332723
DEBUG Config:
[config]
output = 
log = stderr
log-level = debug
log-max = 0
log-keep = 10
log-mode = 0600
dump-memory-profile = simple
memory-dump-interval = 300
working-area = /srv/lorry-working-area
mirror-base-url-push = /srv/lorry-depot
mirror-base-url-fetch = /srv/lorry-depot
pull-only = False
verbose = True
repack = True
command-stdout = None
command-stderr = None
bundle = never
bundle-dest = 
tarball = never
tarball-dest = 
keep-multiple-backups = False
push-option = 
bazaar-command = None
check-certificates = True


DEBUG Python version: 3.8.3 (default, Nov 10 2011, 15:00:00) 
[GCC 10.1.0]
DEBUG Processing spec file /tmp/tmpd2bskdt1
DEBUG Getting: delta/gdbm
DEBUG Getting delta/gdbm
DEBUG .. updating existing clone
DEBUG Running: argv=['git', '-c', 'gc.autodetach=false', 'fetch', '--prune', 'http://git.gnu.org.ua/repo/gdbm.git', '+refs/heads/*:refs/heads/*', '+refs/tags/*:refs/tags/*'] kwargs={'cwd': '/srv/lorry-working-area/delta_gdbm/git-b', 'env': environ({'LANG': 'C.UTF-8', 'PATH': '/usr/local/bin:/usr/bin', 'HOME': '/srv/lorry', 'LOGNAME': 'lorry', 'USER': 'lorry', 'INVOCATION_ID': 'a94e6dd68c25466c9a694360b5c664ca', 'JOURNAL_STREAM': '9:332723'}), 'stdin': <_io.TextIOWrapper name='/dev/null' mode='r' encoding='UTF-8'>}
DEBUG run external command: [['git', '-c', 'gc.autodetach=false', 'fetch', '--prune', 'http://git.gnu.org.ua/repo/gdbm.git', '+refs/heads/*:refs/heads/*', '+refs/tags/*:refs/tags/*']]
DEBUG Command: ['git', '-c', 'gc.autodetach=false', 'fetch', '--prune', 'http://git.gnu.org.ua/repo/gdbm.git', '+refs/heads/*:refs/heads/*', '+refs/tags/*:refs/tags/*']
Exit: 128
Stdout:
Stderr:
    fatal: unable to access 'http://git.gnu.org.ua/repo/gdbm.git/': The requested URL returned error: 403

DEBUG Mirror of delta/gdbm failed, state before mirror is saved at /srv/lorry-working-area/delta_gdbm/git-a and state after mirror is saved at /srv/lorry-working-area/delta_gdbm/git-post-fail

Error mirroring:
Traceback (most recent call last):
  File "/usr/bin/lorry", line 262, in process_args
    self.gitify(name, specs[name])
  File "/usr/bin/lorry", line 375, in gitify
    table[vcstype](name, dirname, temp_repo, spec)
  File "/usr/bin/lorry", line 543, in mirror_git
    self.run_program(argv, cwd=gitdir, env=env)
  File "/usr/bin/lorry", line 868, in run_program
    raise Exception('%s failed (exit code %s):\n%s' %
Exception: git -c gc.autodetach=false fetch --prune http://git.gnu.org.ua/repo/gdbm.git +refs/heads/*:refs/heads/* +refs/tags/*:refs/tags/* failed (exit code 128):
    fatal: unable to access 'http://git.gnu.org.ua/repo/gdbm.git/': The requested URL returned error: 403

ERROR Traceback (most recent call last):
  File "/usr/bin/lorry", line 262, in process_args
    self.gitify(name, specs[name])
  File "/usr/bin/lorry", line 375, in gitify
    table[vcstype](name, dirname, temp_repo, spec)
  File "/usr/bin/lorry", line 543, in mirror_git
    self.run_program(argv, cwd=gitdir, env=env)
  File "/usr/bin/lorry", line 868, in run_program
    raise Exception('%s failed (exit code %s):\n%s' %
Exception: git -c gc.autodetach=false fetch --prune http://git.gnu.org.ua/repo/gdbm.git +refs/heads/*:refs/heads/* +refs/tags/*:refs/tags/* failed (exit code 128):
    fatal: unable to access 'http://git.gnu.org.ua/repo/gdbm.git/': The requested URL returned error: 403


DEBUG Total Mirrors failed: 1
DEBUG Done
Processing spec file /tmp/tmpd2bskdt1
Getting: delta/gdbm
Getting delta/gdbm
.. updating existing clone
Mirror of delta/gdbm failed, state before mirror is saved at /srv/lorry-working-area/delta_gdbm/git-a and state after mirror is saved at /srv/lorry-working-area/delta_gdbm/git-post-fail
Done

25 baserock/baserock/infrastructure 10 min in 5 min 3 s 0
26 delta/genivi/node-health-monitor 3 h in 5 min 4 s 0
27 delta/linux 3 h in 5 min 7 s 0
28 delta/vala 3 h in 5 min 42 s 0
29 delta/genivi/persistence-common-object 3 h in 6 min 45 s 0
30 delta/coreboot/vboot 3 h in 6 min 50 s 0
31 delta/genivi-common-api-runtime 3 h in 6 min 52 s 0
32 delta/genivi/persistence-administrator 3 h in 6 min 53 s 0
33 delta/genivi/persistence-client-library 3 h in 6 min 54 s 0
34 baserock/local-config/lorries 10 min in 6 min 57 s 0
35 delta/qt5/qtwebkit 3 h in 7 min 0
36 delta/genivi/audiomanagerdemo 3 h in 7 min 34 s 0
37 delta/genivi/genivi-demo-platform-hmi 3 h in 7 min 35 s 0
38 delta/coreboot/arm-trusted-firmware 3 h in 7 min 38 s 0
39 delta/xserver 3 h in 7 min 43 s 0
40 delta/zookeeper 3 h in 7 min 48 s 0
41 delta/gettext-tarball 3 h in 7 min 49 s 0
42 delta/gettext-tiny 3 h in 7 min 50 s 0
43 delta/git-fat 3 h in 7 min 51 s 0
44 delta/genivi/wayland-ivi-extension 3 h in 11 min 27 s 0
45 delta/gitano/clod 3 h in 11 min 28 s 0
46 delta/automake 3 h in 11 min 34 s 0
47 delta/couchdb 3 h in 11 min 38 s 0
48 delta/fail2ban 3 h in 11 min 39 s 0
49 delta/gitano/lace 3 h in 11 min 41 s 0
50 delta/cython 3 h in 11 min 44 s 0
51 delta/genivi/positioning 3 h in 11 min 45 s 0
52 delta/gitano/supple 3 h in 11 min 46 s 0
53 delta/genivi/vSomeIP 3 h in 11 min 47 s 0
54 delta/gitano/gall 3 h in 11 min 48 s 0
55 delta/enlightenment/imlib2 3 h in 11 min 50 s 0
56 delta/gitano/gitano 3 h in 11 min 51 s 0
57 delta/boost-tarball 3 h in 11 min 53 s 0
58 delta/classpath 3 h in 11 min 55 s 0
59 delta/linux-next 3 h in 11 min 56 s 0
60 delta/barebox 3 h in 12 min 34 s 0
61 delta/cairo 3 h in 12 min 34 s 0
62 delta/util-linux 3 h in 12 min 54 s 0
63 delta/gitano/luacov 3 h in 12 min 57 s 0
64 delta/cppunit 3 h in 12 min 58 s 0
65 delta/flup 3 h in 12 min 59 s
1: Show log

INFO lorry version 0.0 starts
DEBUG sys.argv: ['/usr/bin/lorry', '--config=/etc/lorry-controller/lorry.conf', '--config=/etc/lc-site/lorry-controller/lorry.conf', '/tmp/tmpgq2zqd32']
DEBUG current working directory: /
DEBUG uid: 998
DEBUG effective uid: 998
DEBUG gid: 998
DEBUG effective gid: 998
DEBUG environment variables:
DEBUG environment: LANG=C.UTF-8
DEBUG environment: PATH=/usr/local/bin:/usr/bin
DEBUG environment: HOME=/srv/lorry
DEBUG environment: LOGNAME=lorry
DEBUG environment: USER=lorry
DEBUG environment: INVOCATION_ID=6ca9258c0ee54d619461ecdd18947ab5
DEBUG environment: JOURNAL_STREAM=9:378599
DEBUG Config:
[config]
output = 
log = stderr
log-level = debug
log-max = 0
log-keep = 10
log-mode = 0600
dump-memory-profile = simple
memory-dump-interval = 300
working-area = /srv/lorry-working-area
mirror-base-url-push = /srv/lorry-depot
mirror-base-url-fetch = /srv/lorry-depot
pull-only = False
verbose = True
repack = True
command-stdout = None
command-stderr = None
bundle = never
bundle-dest = 
tarball = never
tarball-dest = 
keep-multiple-backups = False
push-option = 
bazaar-command = None
check-certificates = True


DEBUG Python version: 3.8.3 (default, Nov 10 2011, 15:00:00) 
[GCC 10.1.0]
DEBUG Processing spec file /tmp/tmpgq2zqd32
DEBUG Getting: delta/flup
DEBUG Getting delta/flup
DEBUG .. updating hg branch
DEBUG Running: argv=['hg', 'pull', '--quiet', 'http://hg.saddi.com/flup-server'] kwargs={'cwd': '/srv/lorry-working-area/delta_flup/hg', 'stdin': <_io.TextIOWrapper name='/dev/null' mode='r' encoding='UTF-8'>}
DEBUG run external command: [['hg', 'pull', '--quiet', 'http://hg.saddi.com/flup-server']]
DEBUG Command: ['hg', 'pull', '--quiet', 'http://hg.saddi.com/flup-server']
Exit: 255
Stdout:
Stderr:
    abort: HTTP Error 404: Not Found

DEBUG Mirror of delta/flup failed, state before mirror is saved at /srv/lorry-working-area/delta_flup/git-a and state after mirror is saved at /srv/lorry-working-area/delta_flup/git-post-fail

Error mirroring:
Traceback (most recent call last):
  File "/usr/bin/lorry", line 262, in process_args
    self.gitify(name, specs[name])
  File "/usr/bin/lorry", line 375, in gitify
    table[vcstype](name, dirname, temp_repo, spec)
  File "/usr/bin/lorry", line 753, in gitify_hg
    self.run_program(
  File "/usr/bin/lorry", line 868, in run_program
    raise Exception('%s failed (exit code %s):\n%s' %
Exception: hg pull --quiet http://hg.saddi.com/flup-server failed (exit code 255):
    abort: HTTP Error 404: Not Found

ERROR Traceback (most recent call last):
  File "/usr/bin/lorry", line 262, in process_args
    self.gitify(name, specs[name])
  File "/usr/bin/lorry", line 375, in gitify
    table[vcstype](name, dirname, temp_repo, spec)
  File "/usr/bin/lorry", line 753, in gitify_hg
    self.run_program(
  File "/usr/bin/lorry", line 868, in run_program
    raise Exception('%s failed (exit code %s):\n%s' %
Exception: hg pull --quiet http://hg.saddi.com/flup-server failed (exit code 255):
    abort: HTTP Error 404: Not Found


DEBUG Total Mirrors failed: 1
DEBUG Done
Processing spec file /tmp/tmpgq2zqd32
Getting: delta/flup
Getting delta/flup
.. updating hg branch
Mirror of delta/flup failed, state before mirror is saved at /srv/lorry-working-area/delta_flup/git-a and state after mirror is saved at /srv/lorry-working-area/delta_flup/git-post-fail
Done

66 delta/e2fsprogs 3 h in 13 min 0
67 delta/elfutils 3 h in 13 min 2 s 0
68 delta/flac 3 h in 13 min 3 s 0
69 delta/coreutils 3 h in 13 min 7 s 0
70 delta/acpica 3 h in 13 min 9 s 0
71 delta/vim-git 3 h in 13 min 48 s 0
72 delta/python-packages/qpid-python 3 h in 13 min 50 s 0
73 delta/xen 3 h in 14 min 33 s 0
74 delta/qt5/qtwebengine-chromium 3 h in 15 min 39 s 0
75 delta/farstream 3 h in 16 min 35 s 0
76 delta/fontconfig 3 h in 16 min 37 s 0
77 delta/gitano/luagit2 3 h in 16 min 39 s 0
78 delta/glu 3 h in 16 min 41 s 0
79 delta/gconf 3 h in 16 min 42 s 0
80 delta/geoclue 3 h in 16 min 43 s 0
81 delta/drm 3 h in 16 min 45 s 0
82 delta/flatpak 3 h in 16 min 46 s 0
83 delta/findutils 3 h in 16 min 49 s 0
84 delta/genivi/navigation 3 h in 16 min 49 s 0
85 delta/exim4 3 h in 17 min 23 s 0
86 delta/python-packages/yoyo 3 h in 18 min 39 s 0
87 delta/qt5/qtdeclarative 3 h in 18 min 47 s 0
88 delta/cups 3 h in 18 min 52 s 0
89 delta/systemd 3 h in 19 min 34 s 0
90 delta/freetype2 3 h in 23 min 28 s 0
91 delta/boost 3 h in 23 min 32 s 0
92 delta/binutils-redhat 3 h in 24 min 47 s 0
93 delta/qt5/qtlocation-mapboxgl 3 h in 25 min 42 s 0
94 delta/fribidi 3 h in 25 min 43 s 0
95 delta/gnome/clutter-gtk 3 h in 25 min 44 s 0
96 delta/rabbitmq-server-git 3 h in 25 min 52 s 0
97 delta/git-review 3 h in 26 min 28 s 0
98 delta/glut 3 h in 26 min 30 s 0
99 delta/gnome-doc-utils 3 h in 26 min 33 s 0
100 delta/gnome/clutter-gst 3 h in 26 min 35 s 0
101 delta/grep-tarball 3 h in 26 min 35 s 0
102 delta/gnome/d-feet 3 h in 26 min 37 s 0
103 delta/gzip-tarball 3 h in 26 min 38 s 0
104 delta/gnome/gcab 3 h in 26 min 39 s 0
105 delta/gitlab/gitlab-ci 3 h in 26 min 40 s 0
106 delta/gitano/libgit2 3 h in 26 min 42 s 0
107 delta/hicolor-icon-theme 3 h in 26 min 43 s 0
108 delta/gnome/baobab 3 h in 26 min 44 s 0
109 delta/gnome/geocode-glib 3 h in 26 min 45 s 0
110 delta/gnome/folks 3 h in 26 min 46 s 0
111 delta/i2c-tools-git 3 h in 26 min 46 s 0
112 delta/itzam-tarball 3 h in 26 min 47 s 0
113 delta/glibmm 3 h in 26 min 48 s 0
114 delta/gitlab/gitlab-shell 3 h in 26 min 49 s 0
115 delta/gnome-keyring 3 h in 26 min 50 s 0
116 delta/gnome/gnome-dictionary 3 h in 26 min 51 s 0
117 delta/gnome/gnome-shell-sass 3 h in 26 min 52 s 0
118 delta/gnome/gcr 3 h in 26 min 53 s 0
119 delta/intltool 3 h in 26 min 53 s
1: Show log

INFO lorry version 0.0 starts
DEBUG sys.argv: ['/usr/bin/lorry', '--config=/etc/lorry-controller/lorry.conf', '--config=/etc/lc-site/lorry-controller/lorry.conf', '/tmp/tmpx2ddnr4v']
DEBUG current working directory: /
DEBUG uid: 998
DEBUG effective uid: 998
DEBUG gid: 998
DEBUG effective gid: 998
DEBUG environment variables:
DEBUG environment: LANG=C.UTF-8
DEBUG environment: PATH=/usr/local/bin:/usr/bin
DEBUG environment: HOME=/srv/lorry
DEBUG environment: LOGNAME=lorry
DEBUG environment: USER=lorry
DEBUG environment: INVOCATION_ID=db0410faa1314185b8526a89a97b11f5
DEBUG environment: JOURNAL_STREAM=9:378598
DEBUG Config:
[config]
output = 
log = stderr
log-level = debug
log-max = 0
log-keep = 10
log-mode = 0600
dump-memory-profile = simple
memory-dump-interval = 300
working-area = /srv/lorry-working-area
mirror-base-url-push = /srv/lorry-depot
mirror-base-url-fetch = /srv/lorry-depot
pull-only = False
verbose = True
repack = True
command-stdout = None
command-stderr = None
bundle = never
bundle-dest = 
tarball = never
tarball-dest = 
keep-multiple-backups = False
push-option = 
bazaar-command = None
check-certificates = True


DEBUG Python version: 3.8.3 (default, Nov 10 2011, 15:00:00) 
[GCC 10.1.0]
DEBUG Processing spec file /tmp/tmpx2ddnr4v
DEBUG Getting: delta/intltool
DEBUG Getting delta/intltool
DEBUG Mirror of delta/intltool failed, state before mirror is saved at /srv/lorry-working-area/delta_intltool/git-a and state after mirror is saved at /srv/lorry-working-area/delta_intltool/git-post-fail

Error mirroring:
Traceback (most recent call last):
  File "/usr/bin/lorry", line 262, in process_args
    self.gitify(name, specs[name])
  File "/usr/bin/lorry", line 375, in gitify
    table[vcstype](name, dirname, temp_repo, spec)
  File "/usr/bin/lorry", line 547, in gitify_bzr
    if os.path.basename(bzr) == 'brz':
  File "/usr/lib/python3.8/posixpath.py", line 142, in basename
    p = os.fspath(p)
TypeError: expected str, bytes or os.PathLike object, not NoneType
ERROR Traceback (most recent call last):
  File "/usr/bin/lorry", line 262, in process_args
    self.gitify(name, specs[name])
  File "/usr/bin/lorry", line 375, in gitify
    table[vcstype](name, dirname, temp_repo, spec)
  File "/usr/bin/lorry", line 547, in gitify_bzr
    if os.path.basename(bzr) == 'brz':
  File "/usr/lib/python3.8/posixpath.py", line 142, in basename
    p = os.fspath(p)
TypeError: expected str, bytes or os.PathLike object, not NoneType

DEBUG Total Mirrors failed: 1
DEBUG Done
Processing spec file /tmp/tmpx2ddnr4v
Getting: delta/intltool
Getting delta/intltool
Mirror of delta/intltool failed, state before mirror is saved at /srv/lorry-working-area/delta_intltool/git-a and state after mirror is saved at /srv/lorry-working-area/delta_intltool/git-post-fail
Done

120 delta/gnome-themes-standard 3 h in 26 min 55 s 0
121 delta/gnome/gupnp-vala 3 h in 26 min 55 s 0
122 delta/gnome/gnome-screenshot 3 h in 26 min 57 s 0
123 delta/gjs 3 h in 26 min 58 s 0
124 delta/gnome/gnome-bluetooth 3 h in 26 min 58 s 0
125 delta/gnome/gupnp-igd 3 h in 26 min 59 s 0
126 delta/gnome/cheese 3 h in 27 min 0
127 delta/gettext 3 h in 27 min 2 s 0
128 delta/bash 3 h in 27 min 42 s 0
129 delta/gnome/gnome-font-viewer 3 h in 27 min 45 s 0
130 delta/gnome/gupnp-av 3 h in 27 min 47 s 0
131 delta/gnome/gupnp-dlna 3 h in 27 min 48 s 0
132 delta/gnome/gupnp-tools 3 h in 27 min 50 s 0
133 delta/gnome/gvdb 3 h in 27 min 52 s 0
134 delta/gnome/gssdp 3 h in 27 min 53 s 0
135 delta/gnome/cogl 3 h in 27 min 55 s 0
136 delta/gnome/grilo 3 h in 27 min 56 s 0
137 delta/gnome/libgee 3 h in 27 min 58 s 0
138 delta/gnome/gnome-logs 3 h in 27 min 59 s 0
139 delta/gnome/gupnp 3 h in 28 min 0
140 delta/glade 3 h in 28 min 2 s 0
141 delta/gnome/gmime 3 h in 28 min 2 s 0
142 delta/gnome/gnome-calendar 3 h in 28 min 3 s 0
143 delta/genivi/poi-service 3 h in 28 min 5 s 0
144 delta/elixir 3 h in 28 min 6 s 0
145 delta/gdm 3 h in 28 min 9 s 0
146 delta/gnome/gnome-initial-setup 3 h in 28 min 10 s 0
147 delta/gnome-common 3 h in 28 min 11 s 0
148 delta/gnome-settings-daemon 3 h in 28 min 12 s 0
149 delta/bullet3 3 h in 28 min 18 s 0
150 delta/gnome/libgd 3 h in 28 min 53 s 0
151 delta/google-compute-image-packages 3 h in 28 min 55 s 0
152 delta/gnome/glib-networking 3 h in 29 min 59 s 0
153 delta/gnome/libgfbgraph 3 h in 30 min 1 s 0
154 delta/gnome/libchamplain 3 h in 30 min 3 s 0
155 delta/gperftools 3 h in 30 min 5 s 0
156 delta/gnome/grilo-plugins 3 h in 30 min 8 s 0
157 delta/gnome/libgnome-volume-control 3 h in 30 min 10 s 0
158 delta/gnome/libmediaart 3 h in 30 min 12 s 0
159 delta/gnome/gnome-color-manager 3 h in 30 min 15 s 0
160 delta/openwrt/openwrt 3 h in 30 min 17 s 0
161 delta/gnome/libnotify 3 h in 30 min 18 s 0
162 delta/hyphen 3 h in 30 min 19 s 0
163 delta/gnome/librest 3 h in 30 min 21 s 0
164 delta/gnome/libsecret 3 h in 30 min 23 s 0
165 delta/ibus-anthy 3 h in 30 min 24 s 0
166 delta/gnome/totem-pl-parser 3 h in 30 min 27 s 0
167 delta/gnome/libpeas 3 h in 30 min 29 s 0
168 delta/smartdevicelink/sdl_core 3 h in 30 min 29 s 0
169 delta/gperf 3 h in 30 min 32 s 0
170 delta/gusb 3 h in 30 min 33 s 0
171 delta/gnome/gnome-contacts 3 h in 30 min 34 s 0
172 delta/icu 3 h in 30 min 34 s 0
173 delta/isc-dhcp-tarball 3 h in 30 min 36 s 0
174 delta/gpgme 3 h in 30 min 37 s 0
175 delta/gnome/gnome-online-accounts 3 h in 30 min 39 s 0
176 delta/gnome/gnome-todo 3 h in 30 min 40 s 0
177 delta/gnome/libgnomekbd 3 h in 30 min 41 s 0
178 delta/gnome/libgtop 3 h in 30 min 42 s 0
179 delta/gnu-efi 3 h in 30 min 43 s 0
180 delta/gtk-doc-stub 3 h in 30 min 44 s 0
181 delta/ibus-hangul 3 h in 30 min 44 s 0
182 delta/googletest-git 3 h in 30 min 45 s 0
183 delta/sudo 3 h in 31 min 18 s 0
184 delta/iotop 3 h in 31 min 39 s 0
185 delta/python-packages/django 3 h in 32 min 10 s 0
186 delta/ruby-gems/chef 3 h in 32 min 23 s 0
187 delta/gst-omx 3 h in 32 min 31 s 0
188 delta/ibus 3 h in 32 min 32 s 0
189 delta/ibus-libpinyin 3 h in 32 min 34 s 0
190 delta/ipset 3 h in 32 min 36 s 0
191 delta/js185 3 h in 32 min 37 s 0
192 delta/libIDL 3 h in 32 min 37 s 0
193 delta/less 3 h in 32 min 38 s 0
194 delta/enlightenment/elementary 3 h in 32 min 39 s 0
195 delta/gnome/gsettings-desktop-schemas 3 h in 32 min 41 s 0
196 delta/gstreamer-common 3 h in 32 min 43 s 0
197 delta/ibus-pinyin 3 h in 32 min 44 s 0
198 delta/itstool 3 h in 32 min 44 s 0
199 delta/gawk 3 h in 32 min 45 s 0
200 delta/ipmitool 3 h in 32 min 45 s 0
201 delta/keyutils 3 h in 32 min 46 s 0
202 delta/libeditline-tarball 3 h in 32 min 46 s 0
203 delta/iproute2 3 h in 32 min 47 s 0
204 delta/gnome/clutter 3 h in 32 min 50 s 0
205 delta/curl 3 h in 32 min 51 s 0
206 delta/gnome/gnome-terminal 3 h in 32 min 53 s 0
207 delta/gnome/gtksourceview 3 h in 32 min 54 s 0
208 delta/fontutils 3 h in 32 min 55 s 0
209 delta/freertos-git 3 h in 32 min 59 s 0
210 delta/iptables 3 h in 33 min 28 s 0
211 delta/kexec-tools 3 h in 33 min 29 s 0
212 delta/libatasmart 3 h in 33 min 30 s 0
213 delta/libexif-tarball 3 h in 33 min 31 s 0
214 delta/gnome/gnome-maps 3 h in 33 min 34 s 0
215 delta/gst-libav 3 h in 33 min 36 s 0
216 delta/iputils 3 h in 33 min 38 s 0
217 delta/kmod 3 h in 33 min 38 s 0
218 delta/gnome/gnome-session 3 h in 33 min 42 s 0
219 delta/grep 3 h in 33 min 44 s 0
220 delta/gstreamer-vaapi 3 h in 33 min 46 s 0
221 delta/libical 3 h in 33 min 47 s 0
222 delta/jackaudio/jack1 3 h in 33 min 48 s 0
223 delta/jenkinstool 3 h in 33 min 50 s 0
224 delta/libmemcached 3 h in 33 min 52 s
1: Show log

INFO lorry version 0.0 starts
DEBUG sys.argv: ['/usr/bin/lorry', '--config=/etc/lorry-controller/lorry.conf', '--config=/etc/lc-site/lorry-controller/lorry.conf', '/tmp/tmp6yj_w022']
DEBUG current working directory: /
DEBUG uid: 998
DEBUG effective uid: 998
DEBUG gid: 998
DEBUG effective gid: 998
DEBUG environment variables:
DEBUG environment: LANG=C.UTF-8
DEBUG environment: PATH=/usr/local/bin:/usr/bin
DEBUG environment: HOME=/srv/lorry
DEBUG environment: LOGNAME=lorry
DEBUG environment: USER=lorry
DEBUG environment: INVOCATION_ID=6ca9258c0ee54d619461ecdd18947ab5
DEBUG environment: JOURNAL_STREAM=9:378599
DEBUG Config:
[config]
output = 
log = stderr
log-level = debug
log-max = 0
log-keep = 10
log-mode = 0600
dump-memory-profile = simple
memory-dump-interval = 300
working-area = /srv/lorry-working-area
mirror-base-url-push = /srv/lorry-depot
mirror-base-url-fetch = /srv/lorry-depot
pull-only = False
verbose = True
repack = True
command-stdout = None
command-stderr = None
bundle = never
bundle-dest = 
tarball = never
tarball-dest = 
keep-multiple-backups = False
push-option = 
bazaar-command = None
check-certificates = True


DEBUG Python version: 3.8.3 (default, Nov 10 2011, 15:00:00) 
[GCC 10.1.0]
DEBUG Processing spec file /tmp/tmp6yj_w022
DEBUG Getting: delta/libmemcached
DEBUG Getting delta/libmemcached
DEBUG Mirror of delta/libmemcached failed, state before mirror is saved at /srv/lorry-working-area/delta_libmemcached/git-a and state after mirror is saved at /srv/lorry-working-area/delta_libmemcached/git-post-fail

Error mirroring:
Traceback (most recent call last):
  File "/usr/bin/lorry", line 262, in process_args
    self.gitify(name, specs[name])
  File "/usr/bin/lorry", line 375, in gitify
    table[vcstype](name, dirname, temp_repo, spec)
  File "/usr/bin/lorry", line 547, in gitify_bzr
    if os.path.basename(bzr) == 'brz':
  File "/usr/lib/python3.8/posixpath.py", line 142, in basename
    p = os.fspath(p)
TypeError: expected str, bytes or os.PathLike object, not NoneType
ERROR Traceback (most recent call last):
  File "/usr/bin/lorry", line 262, in process_args
    self.gitify(name, specs[name])
  File "/usr/bin/lorry", line 375, in gitify
    table[vcstype](name, dirname, temp_repo, spec)
  File "/usr/bin/lorry", line 547, in gitify_bzr
    if os.path.basename(bzr) == 'brz':
  File "/usr/lib/python3.8/posixpath.py", line 142, in basename
    p = os.fspath(p)
TypeError: expected str, bytes or os.PathLike object, not NoneType

DEBUG Total Mirrors failed: 1
DEBUG Done
Processing spec file /tmp/tmp6yj_w022
Getting: delta/libmemcached
Getting delta/libmemcached
Mirror of delta/libmemcached failed, state before mirror is saved at /srv/lorry-working-area/delta_libmemcached/git-a and state after mirror is saved at /srv/lorry-working-area/delta_libmemcached/git-post-fail
Done

225 delta/leveldb 3 h in 33 min 53 s 0
226 delta/gnome/glade 3 h in 33 min 54 s 0
227 delta/libcanberra 3 h in 33 min 54 s 0
228 delta/gtk-doc 3 h in 33 min 55 s 0
229 delta/json-c 3 h in 33 min 56 s 0
230 delta/gnome/empathy 3 h in 33 min 57 s 0
231 delta/libdaemon 3 h in 33 min 57 s 0
232 delta/gzip 3 h in 33 min 58 s 0
233 delta/jq 3 h in 33 min 59 s 0
234 delta/libassuan 3 h in 33 min 59 s 0
235 delta/libcap2 3 h in 33 min 59 s 0
236 delta/libmad-tarball 3 h in 33 min 59 s 0
237 delta/linux-rt 3 h in 34 min 8 s 0
238 delta/jsonschema 3 h in 34 min 34 s 0
239 delta/libmpeg2-tarball 3 h in 34 min 34 s 0
240 delta/libfaketime 3 h in 34 min 36 s 0
241 delta/libmnl 3 h in 34 min 36 s 0
242 delta/libepoxy 3 h in 34 min 38 s 0
243 delta/libimobiledevice/libplist 3 h in 34 min 39 s 0
244 delta/libatomic_ops 3 h in 34 min 41 s 0
245 delta/liberasurecode 3 h in 34 min 42 s 0
246 delta/libimobiledevice/libirecovery 3 h in 34 min 43 s 0
247 delta/gnome/yelp 3 h in 34 min 46 s 0
248 delta/gnome/telepathy-account-widgets 3 h in 34 min 47 s 0
249 delta/iceauth 3 h in 34 min 48 s 0
250 delta/jinja2 3 h in 34 min 49 s 0
251 delta/gobject-introspection 3 h in 34 min 51 s 0
252 delta/help2man 3 h in 34 min 52 s 0
253 delta/gnome/eog 3 h in 34 min 54 s 0
254 delta/jemalloc 3 h in 34 min 54 s 0
255 delta/libimobiledevice/libideviceactivation 3 h in 34 min 54 s 0
256 delta/libimobiledevice/libimobiledevice 3 h in 34 min 55 s 0
257 delta/gnome/gnome-desktop 3 h in 35 min 50 s 0
258 delta/libimobiledevice/libusbmuxd 3 h in 35 min 52 s 0
259 delta/gnome/network-manager-applet 3 h in 35 min 55 s 0
260 delta/gnome/vte 3 h in 35 min 56 s 0
261 delta/libflangrt 3 h in 35 min 57 s 0
262 delta/gvfs 3 h in 35 min 59 s 0
263 delta/libgpg-error 3 h in 35 min 59 s 0
264 delta/jackaudio/jack2 3 h in 36 min 1 s 0
265 delta/libimobiledevice/usbmuxd 3 h in 36 min 3 s 0
266 delta/libnetfilter_cttimeout 3 h in 36 min 4 s 0
267 delta/evolution-data-server 3 h in 36 min 8 s 0
268 delta/flang 3 h in 36 min 10 s 0
269 delta/fpc 3 h in 36 min 10 s
1: Show log

INFO lorry version 0.0 starts
DEBUG sys.argv: ['/usr/bin/lorry', '--config=/etc/lorry-controller/lorry.conf', '--config=/etc/lc-site/lorry-controller/lorry.conf', '/tmp/tmpqvryayr6']
DEBUG current working directory: /
DEBUG uid: 998
DEBUG effective uid: 998
DEBUG gid: 998
DEBUG effective gid: 998
DEBUG environment variables:
DEBUG environment: LANG=C.UTF-8
DEBUG environment: PATH=/usr/local/bin:/usr/bin
DEBUG environment: HOME=/srv/lorry
DEBUG environment: LOGNAME=lorry
DEBUG environment: USER=lorry
DEBUG environment: INVOCATION_ID=a94e6dd68c25466c9a694360b5c664ca
DEBUG environment: JOURNAL_STREAM=9:332723
DEBUG Config:
[config]
output = 
log = stderr
log-level = debug
log-max = 0
log-keep = 10
log-mode = 0600
dump-memory-profile = simple
memory-dump-interval = 300
working-area = /srv/lorry-working-area
mirror-base-url-push = /srv/lorry-depot
mirror-base-url-fetch = /srv/lorry-depot
pull-only = False
verbose = True
repack = True
command-stdout = None
command-stderr = None
bundle = never
bundle-dest = 
tarball = never
tarball-dest = 
keep-multiple-backups = False
push-option = 
bazaar-command = None
check-certificates = True


DEBUG Python version: 3.8.3 (default, Nov 10 2011, 15:00:00) 
[GCC 10.1.0]
DEBUG Processing spec file /tmp/tmpqvryayr6
DEBUG Getting: delta/fpc
DEBUG Getting delta/fpc
DEBUG .. updating existing clone
DEBUG Running: argv=['git', 'config', 'svn-remote.svn.url', 'https://svn.freepascal.org/svn/fpc'] kwargs={'cwd': '/srv/lorry-working-area/delta_fpc/git-b', 'stdin': <_io.TextIOWrapper name='/dev/null' mode='r' encoding='UTF-8'>}
DEBUG run external command: [['git', 'config', 'svn-remote.svn.url', 'https://svn.freepascal.org/svn/fpc']]
DEBUG Command: ['git', 'config', 'svn-remote.svn.url', 'https://svn.freepascal.org/svn/fpc']
Exit: 0
Stdout:
Stderr:

DEBUG Running: argv=['git', 'config', 'svn-remote.svn.fetch', ':refs/remotes/git-svn'] kwargs={'cwd': '/srv/lorry-working-area/delta_fpc/git-b', 'stdin': <_io.TextIOWrapper name='/dev/null' mode='r' encoding='UTF-8'>}
DEBUG run external command: [['git', 'config', 'svn-remote.svn.fetch', ':refs/remotes/git-svn']]
DEBUG Command: ['git', 'config', 'svn-remote.svn.fetch', ':refs/remotes/git-svn']
Exit: 0
Stdout:
Stderr:

DEBUG Running: argv=['git', 'config', 'svn-remote.svn.fetch', 'trunk:refs/heads/master'] kwargs={'cwd': '/srv/lorry-working-area/delta_fpc/git-b', 'stdin': <_io.TextIOWrapper name='/dev/null' mode='r' encoding='UTF-8'>}
DEBUG run external command: [['git', 'config', 'svn-remote.svn.fetch', 'trunk:refs/heads/master']]
DEBUG Command: ['git', 'config', 'svn-remote.svn.fetch', 'trunk:refs/heads/master']
Exit: 0
Stdout:
Stderr:

DEBUG Running: argv=['git', 'config', 'svn-remote.svn.branches', 'branches/*:refs/heads/*'] kwargs={'cwd': '/srv/lorry-working-area/delta_fpc/git-b', 'stdin': <_io.TextIOWrapper name='/dev/null' mode='r' encoding='UTF-8'>}
DEBUG run external command: [['git', 'config', 'svn-remote.svn.branches', 'branches/*:refs/heads/*']]
DEBUG Command: ['git', 'config', 'svn-remote.svn.branches', 'branches/*:refs/heads/*']
Exit: 0
Stdout:
Stderr:

DEBUG Running: argv=['git', 'config', 'svn-remote.svn.tags', 'tags/*:refs/tags/*'] kwargs={'cwd': '/srv/lorry-working-area/delta_fpc/git-b', 'stdin': <_io.TextIOWrapper name='/dev/null' mode='r' encoding='UTF-8'>}
DEBUG run external command: [['git', 'config', 'svn-remote.svn.tags', 'tags/*:refs/tags/*']]
DEBUG Command: ['git', 'config', 'svn-remote.svn.tags', 'tags/*:refs/tags/*']
Exit: 0
Stdout:
Stderr:

DEBUG Running: argv=['git', 'svn', 'fetch'] kwargs={'cwd': '/srv/lorry-working-area/delta_fpc/git-b', 'stdin': <_io.TextIOWrapper name='/dev/null' mode='r' encoding='UTF-8'>}
DEBUG run external command: [['git', 'svn', 'fetch']]
DEBUG Command: ['git', 'svn', 'fetch']
Exit: 1
Stdout:
Stderr:
    Can't create session: Unable to connect to a repository at URL 'https://svn.freepascal.org/svn/fpc': Error running context: No route to host at /usr/share/perl5/Git/SVN.pm line 148.
    

DEBUG Mirror of delta/fpc failed, state before mirror is saved at /srv/lorry-working-area/delta_fpc/git-a and state after mirror is saved at /srv/lorry-working-area/delta_fpc/git-post-fail

Error mirroring:
Traceback (most recent call last):
  File "/usr/bin/lorry", line 262, in process_args
    self.gitify(name, specs[name])
  File "/usr/bin/lorry", line 375, in gitify
    table[vcstype](name, dirname, temp_repo, spec)
  File "/usr/bin/lorry", line 676, in gitify_svn
    self.run_program(['git', 'svn', 'fetch'], cwd=gitdir)
  File "/usr/bin/lorry", line 868, in run_program
    raise Exception('%s failed (exit code %s):\n%s' %
Exception: git svn fetch failed (exit code 1):
    Can't create session: Unable to connect to a repository at URL 'https://svn.freepascal.org/svn/fpc': Error running context: No route to host at /usr/share/perl5/Git/SVN.pm line 148.
    

ERROR Traceback (most recent call last):
  File "/usr/bin/lorry", line 262, in process_args
    self.gitify(name, specs[name])
  File "/usr/bin/lorry", line 375, in gitify
    table[vcstype](name, dirname, temp_repo, spec)
  File "/usr/bin/lorry", line 676, in gitify_svn
    self.run_program(['git', 'svn', 'fetch'], cwd=gitdir)
  File "/usr/bin/lorry", line 868, in run_program
    raise Exception('%s failed (exit code %s):\n%s' %
Exception: git svn fetch failed (exit code 1):
    Can't create session: Unable to connect to a repository at URL 'https://svn.freepascal.org/svn/fpc': Error running context: No route to host at /usr/share/perl5/Git/SVN.pm line 148.
    


DEBUG Total Mirrors failed: 1
DEBUG Done
Processing spec file /tmp/tmpqvryayr6
Getting: delta/fpc
Getting delta/fpc
.. updating existing clone
Mirror of delta/fpc failed, state before mirror is saved at /srv/lorry-working-area/delta_fpc/git-a and state after mirror is saved at /srv/lorry-working-area/delta_fpc/git-post-fail
Done

270 delta/liboauth 3 h in 36 min 37 s 0
271 delta/libnetfilter_conntrack 3 h in 36 min 38 s 0
272 delta/libserf-tarball 3 h in 37 min 4 s 0
273 delta/libvorbis 3 h in 37 min 5 s 0
274 delta/hg-fast-export 3 h in 37 min 13 s 0
275 delta/docker 3 h in 37 min 14 s 0
276 delta/libnfnetlink 3 h in 37 min 14 s 0
277 delta/gf-complete 3 h in 37 min 15 s
1: Show log

INFO lorry version 0.0 starts
DEBUG sys.argv: ['/usr/bin/lorry', '--config=/etc/lorry-controller/lorry.conf', '--config=/etc/lc-site/lorry-controller/lorry.conf', '/tmp/tmpzzxpyens']
DEBUG current working directory: /
DEBUG uid: 998
DEBUG effective uid: 998
DEBUG gid: 998
DEBUG effective gid: 998
DEBUG environment variables:
DEBUG environment: LANG=C.UTF-8
DEBUG environment: PATH=/usr/local/bin:/usr/bin
DEBUG environment: HOME=/srv/lorry
DEBUG environment: LOGNAME=lorry
DEBUG environment: USER=lorry
DEBUG environment: INVOCATION_ID=6ca9258c0ee54d619461ecdd18947ab5
DEBUG environment: JOURNAL_STREAM=9:378599
DEBUG Config:
[config]
output = 
log = stderr
log-level = debug
log-max = 0
log-keep = 10
log-mode = 0600
dump-memory-profile = simple
memory-dump-interval = 300
working-area = /srv/lorry-working-area
mirror-base-url-push = /srv/lorry-depot
mirror-base-url-fetch = /srv/lorry-depot
pull-only = False
verbose = True
repack = True
command-stdout = None
command-stderr = None
bundle = never
bundle-dest = 
tarball = never
tarball-dest = 
keep-multiple-backups = False
push-option = 
bazaar-command = None
check-certificates = True


DEBUG Python version: 3.8.3 (default, Nov 10 2011, 15:00:00) 
[GCC 10.1.0]
DEBUG Processing spec file /tmp/tmpzzxpyens
DEBUG Getting: delta/gf-complete
DEBUG Getting delta/gf-complete
DEBUG .. updating existing clone
DEBUG Running: argv=['git', '-c', 'gc.autodetach=false', 'fetch', '--prune', 'http://lab.jerasure.org/jerasure/gf-complete.git', '+refs/heads/*:refs/heads/*', '+refs/tags/*:refs/tags/*'] kwargs={'cwd': '/srv/lorry-working-area/delta_gf-complete/git-b', 'env': environ({'LANG': 'C.UTF-8', 'PATH': '/usr/local/bin:/usr/bin', 'HOME': '/srv/lorry', 'LOGNAME': 'lorry', 'USER': 'lorry', 'INVOCATION_ID': '6ca9258c0ee54d619461ecdd18947ab5', 'JOURNAL_STREAM': '9:378599'}), 'stdin': <_io.TextIOWrapper name='/dev/null' mode='r' encoding='UTF-8'>}
DEBUG run external command: [['git', '-c', 'gc.autodetach=false', 'fetch', '--prune', 'http://lab.jerasure.org/jerasure/gf-complete.git', '+refs/heads/*:refs/heads/*', '+refs/tags/*:refs/tags/*']]
DEBUG Command: ['git', '-c', 'gc.autodetach=false', 'fetch', '--prune', 'http://lab.jerasure.org/jerasure/gf-complete.git', '+refs/heads/*:refs/heads/*', '+refs/tags/*:refs/tags/*']
Exit: 128
Stdout:
Stderr:
    fatal: unable to update url base from redirection:
      asked for: http://lab.jerasure.org/jerasure/gf-complete.git/info/refs?service=git-upload-pack
       redirect: https://jerasure.org/

DEBUG Mirror of delta/gf-complete failed, state before mirror is saved at /srv/lorry-working-area/delta_gf-complete/git-a and state after mirror is saved at /srv/lorry-working-area/delta_gf-complete/git-post-fail

Error mirroring:
Traceback (most recent call last):
  File "/usr/bin/lorry", line 262, in process_args
    self.gitify(name, specs[name])
  File "/usr/bin/lorry", line 375, in gitify
    table[vcstype](name, dirname, temp_repo, spec)
  File "/usr/bin/lorry", line 543, in mirror_git
    self.run_program(argv, cwd=gitdir, env=env)
  File "/usr/bin/lorry", line 868, in run_program
    raise Exception('%s failed (exit code %s):\n%s' %
Exception: git -c gc.autodetach=false fetch --prune http://lab.jerasure.org/jerasure/gf-complete.git +refs/heads/*:refs/heads/* +refs/tags/*:refs/tags/* failed (exit code 128):
    fatal: unable to update url base from redirection:
      asked for: http://lab.jerasure.org/jerasure/gf-complete.git/info/refs?service=git-upload-pack
       redirect: https://jerasure.org/

ERROR Traceback (most recent call last):
  File "/usr/bin/lorry", line 262, in process_args
    self.gitify(name, specs[name])
  File "/usr/bin/lorry", line 375, in gitify
    table[vcstype](name, dirname, temp_repo, spec)
  File "/usr/bin/lorry", line 543, in mirror_git
    self.run_program(argv, cwd=gitdir, env=env)
  File "/usr/bin/lorry", line 868, in run_program
    raise Exception('%s failed (exit code %s):\n%s' %
Exception: git -c gc.autodetach=false fetch --prune http://lab.jerasure.org/jerasure/gf-complete.git +refs/heads/*:refs/heads/* +refs/tags/*:refs/tags/* failed (exit code 128):
    fatal: unable to update url base from redirection:
      asked for: http://lab.jerasure.org/jerasure/gf-complete.git/info/refs?service=git-upload-pack
       redirect: https://jerasure.org/


DEBUG Total Mirrors failed: 1
DEBUG Done
Processing spec file /tmp/tmpzzxpyens
Getting: delta/gf-complete
Getting delta/gf-complete
.. updating existing clone
Mirror of delta/gf-complete failed, state before mirror is saved at /srv/lorry-working-area/delta_gf-complete/git-a and state after mirror is saved at /srv/lorry-working-area/delta_gf-complete/git-post-fail
Done

278 delta/libnetfilter_cthelper 3 h in 37 min 15 s 0
279 delta/libtool-tarball 3 h in 37 min 16 s 0
280 delta/linux-pam 3 h in 37 min 16 s 0
281 delta/libcroco 3 h in 37 min 18 s 0
282 delta/libsndfile 3 h in 37 min 18 s 0
283 delta/libffi 3 h in 37 min 19 s 0
284 delta/kmscube 3 h in 37 min 21 s 0
285 delta/libogg 3 h in 37 min 21 s 0
286 delta/libva 3 h in 37 min 21 s
1: Show log

INFO lorry version 0.0 starts
DEBUG sys.argv: ['/usr/bin/lorry', '--config=/etc/lorry-controller/lorry.conf', '--config=/etc/lc-site/lorry-controller/lorry.conf', '/tmp/tmp9vwayg23']
DEBUG current working directory: /
DEBUG uid: 998
DEBUG effective uid: 998
DEBUG gid: 998
DEBUG effective gid: 998
DEBUG environment variables:
DEBUG environment: LANG=C.UTF-8
DEBUG environment: PATH=/usr/local/bin:/usr/bin
DEBUG environment: HOME=/srv/lorry
DEBUG environment: LOGNAME=lorry
DEBUG environment: USER=lorry
DEBUG environment: INVOCATION_ID=3213f572a01648f39e23ca04a92b6da3
DEBUG environment: JOURNAL_STREAM=9:332716
DEBUG Config:
[config]
output = 
log = stderr
log-level = debug
log-max = 0
log-keep = 10
log-mode = 0600
dump-memory-profile = simple
memory-dump-interval = 300
working-area = /srv/lorry-working-area
mirror-base-url-push = /srv/lorry-depot
mirror-base-url-fetch = /srv/lorry-depot
pull-only = False
verbose = True
repack = True
command-stdout = None
command-stderr = None
bundle = never
bundle-dest = 
tarball = never
tarball-dest = 
keep-multiple-backups = False
push-option = 
bazaar-command = None
check-certificates = True


DEBUG Python version: 3.8.3 (default, Nov 10 2011, 15:00:00) 
[GCC 10.1.0]
DEBUG Processing spec file /tmp/tmp9vwayg23
DEBUG Getting: delta/libva
DEBUG Getting delta/libva
DEBUG .. updating existing clone
DEBUG Running: argv=['git', '-c', 'gc.autodetach=false', 'fetch', '--prune', 'https://github.com/01org/libva.git', '+refs/heads/*:refs/heads/*', '+refs/tags/*:refs/tags/*'] kwargs={'cwd': '/srv/lorry-working-area/delta_libva/git-a', 'env': environ({'LANG': 'C.UTF-8', 'PATH': '/usr/local/bin:/usr/bin', 'HOME': '/srv/lorry', 'LOGNAME': 'lorry', 'USER': 'lorry', 'INVOCATION_ID': '3213f572a01648f39e23ca04a92b6da3', 'JOURNAL_STREAM': '9:332716'}), 'stdin': <_io.TextIOWrapper name='/dev/null' mode='r' encoding='UTF-8'>}
DEBUG run external command: [['git', '-c', 'gc.autodetach=false', 'fetch', '--prune', 'https://github.com/01org/libva.git', '+refs/heads/*:refs/heads/*', '+refs/tags/*:refs/tags/*']]
DEBUG Command: ['git', '-c', 'gc.autodetach=false', 'fetch', '--prune', 'https://github.com/01org/libva.git', '+refs/heads/*:refs/heads/*', '+refs/tags/*:refs/tags/*']
Exit: 128
Stdout:
Stderr:
    fatal: could not read Username for 'https://github.com': No such device or address

DEBUG Mirror of delta/libva failed, state before mirror is saved at /srv/lorry-working-area/delta_libva/git-b and state after mirror is saved at /srv/lorry-working-area/delta_libva/git-post-fail

Error mirroring:
Traceback (most recent call last):
  File "/usr/bin/lorry", line 262, in process_args
    self.gitify(name, specs[name])
  File "/usr/bin/lorry", line 375, in gitify
    table[vcstype](name, dirname, temp_repo, spec)
  File "/usr/bin/lorry", line 543, in mirror_git
    self.run_program(argv, cwd=gitdir, env=env)
  File "/usr/bin/lorry", line 868, in run_program
    raise Exception('%s failed (exit code %s):\n%s' %
Exception: git -c gc.autodetach=false fetch --prune https://github.com/01org/libva.git +refs/heads/*:refs/heads/* +refs/tags/*:refs/tags/* failed (exit code 128):
    fatal: could not read Username for 'https://github.com': No such device or address

ERROR Traceback (most recent call last):
  File "/usr/bin/lorry", line 262, in process_args
    self.gitify(name, specs[name])
  File "/usr/bin/lorry", line 375, in gitify
    table[vcstype](name, dirname, temp_repo, spec)
  File "/usr/bin/lorry", line 543, in mirror_git
    self.run_program(argv, cwd=gitdir, env=env)
  File "/usr/bin/lorry", line 868, in run_program
    raise Exception('%s failed (exit code %s):\n%s' %
Exception: git -c gc.autodetach=false fetch --prune https://github.com/01org/libva.git +refs/heads/*:refs/heads/* +refs/tags/*:refs/tags/* failed (exit code 128):
    fatal: could not read Username for 'https://github.com': No such device or address


DEBUG Total Mirrors failed: 1
DEBUG Done
Processing spec file /tmp/tmp9vwayg23
Getting: delta/libva
Getting delta/libva
.. updating existing clone
Mirror of delta/libva failed, state before mirror is saved at /srv/lorry-working-area/delta_libva/git-b and state after mirror is saved at /srv/lorry-working-area/delta_libva/git-post-fail
Done

287 delta/libaio 3 h in 37 min 23 s 0
288 delta/json-glib 3 h in 37 min 24 s 0
289 delta/libevent 3 h in 37 min 24 s 0
290 delta/libnl 3 h in 37 min 25 s 0
291 delta/libglnx 3 h in 37 min 26 s 0
292 delta/libgsystem 3 h in 37 min 26 s 0
293 delta/libhangul 3 h in 37 min 27 s 0
294 delta/libndp 3 h in 37 min 27 s 0
295 delta/libnet 3 h in 37 min 28 s 0
296 delta/libexpat-git 3 h in 37 min 29 s 0
297 delta/libgcrypt 3 h in 37 min 29 s 0
298 delta/libnetfilter_queue 3 h in 37 min 30 s 0
299 delta/gstreamer-plugins-ugly 3 h in 37 min 31 s 0
300 delta/libgudev 3 h in 37 min 31 s 0
301 delta/libarchive 3 h in 37 min 32 s 0
302 delta/liboil 3 h in 37 min 32 s 0
303 delta/libmbim 3 h in 37 min 33 s 0
304 delta/libpinyin 3 h in 37 min 33 s 0
305 delta/libevdev 3 h in 37 min 34 s 0
306 delta/libsha1 3 h in 37 min 34 s 0
307 delta/libproxy-git 3 h in 37 min 35 s 0
308 delta/libpwquality-git 3 h in 37 min 35 s 0
309 delta/librsync 3 h in 37 min 36 s 0
310 delta/libseccomp 3 h in 37 min 36 s 0
311 delta/libnice 3 h in 37 min 37 s 0
312 delta/libvirt-python 3 h in 37 min 37 s 0
313 delta/libwww-perl/uri 3 h in 37 min 38 s 0
314 delta/libyaml-git 3 h in 37 min 38 s 0
315 delta/lightdm-gtk-greeter-git 3 h in 37 min 39 s 0
316 delta/lsof 3 h in 37 min 39 s 0
317 delta/libpciaccess 3 h in 38 min 13 s 0
318 delta/libgdata 3 h in 38 min 15 s 0
319 delta/libical-git 3 h in 38 min 17 s 0
320 delta/libusb 3 h in 38 min 18 s 0
321 delta/busybox 3 h in 38 min 19 s 0
322 delta/libva-intel-driver 3 h in 38 min 20 s 0
323 delta/libxklavier 3 h in 38 min 20 s 0
324 delta/libpcap 3 h in 38 min 22 s 0
325 delta/libinput 3 h in 38 min 23 s 0
326 delta/libqmi 3 h in 38 min 24 s 0
327 delta/libtasn1 3 h in 38 min 25 s 0
328 delta/libunistring 3 h in 38 min 26 s 0
329 delta/libgd 3 h in 38 min 27 s 0
330 delta/libosinfo 3 h in 38 min 28 s 0
331 delta/libtiff-git 3 h in 38 min 29 s 0
332 delta/libunwind 3 h in 38 min 30 s 0
333 delta/libxslt 3 h in 38 min 32 s 0
334 delta/libmtp 3 h in 39 min 6 s 0
335 delta/linux-pam-git 3 h in 39 min 6 s 0
336 delta/libwnck 3 h in 39 min 9 s 0
337 delta/linux-user-chroot 3 h in 39 min 11 s 0
338 delta/libtool 3 h in 39 min 13 s 0
339 delta/linuxwacom/xf86-input-wacom 3 h in 39 min 15 s 0
340 delta/NetworkManager 3 h in 39 min 26 s 0
341 delta/linuxwacom/libwacom 3 h in 39 min 27 s 0
342 delta/groff-git 3 h in 39 min 30 s 0
343 delta/lightdm-git 3 h in 39 min 32 s 0
344 delta/lzo 3 h in 39 min 33 s 0
345 delta/libeditline 3 h in 39 min 36 s 0
346 delta/musl 3 h in 39 min 37 s
1: Show log

INFO lorry version 0.0 starts
DEBUG sys.argv: ['/usr/bin/lorry', '--config=/etc/lorry-controller/lorry.conf', '--config=/etc/lc-site/lorry-controller/lorry.conf', '/tmp/tmpsnk79u6m']
DEBUG current working directory: /
DEBUG uid: 998
DEBUG effective uid: 998
DEBUG gid: 998
DEBUG effective gid: 998
DEBUG environment variables:
DEBUG environment: LANG=C.UTF-8
DEBUG environment: PATH=/usr/local/bin:/usr/bin
DEBUG environment: HOME=/srv/lorry
DEBUG environment: LOGNAME=lorry
DEBUG environment: USER=lorry
DEBUG environment: INVOCATION_ID=3213f572a01648f39e23ca04a92b6da3
DEBUG environment: JOURNAL_STREAM=9:332716
DEBUG Config:
[config]
output = 
log = stderr
log-level = debug
log-max = 0
log-keep = 10
log-mode = 0600
dump-memory-profile = simple
memory-dump-interval = 300
working-area = /srv/lorry-working-area
mirror-base-url-push = /srv/lorry-depot
mirror-base-url-fetch = /srv/lorry-depot
pull-only = False
verbose = True
repack = True
command-stdout = None
command-stderr = None
bundle = never
bundle-dest = 
tarball = never
tarball-dest = 
keep-multiple-backups = False
push-option = 
bazaar-command = None
check-certificates = True


DEBUG Python version: 3.8.3 (default, Nov 10 2011, 15:00:00) 
[GCC 10.1.0]
DEBUG Processing spec file /tmp/tmpsnk79u6m
DEBUG Getting: delta/musl
DEBUG Getting delta/musl
DEBUG .. updating existing clone
DEBUG Running: argv=['git', '-c', 'gc.autodetach=false', 'fetch', '--prune', 'https://git.musl-libc.org/git/musl', '+refs/heads/*:refs/heads/*', '+refs/tags/*:refs/tags/*'] kwargs={'cwd': '/srv/lorry-working-area/delta_musl/git-b', 'env': environ({'LANG': 'C.UTF-8', 'PATH': '/usr/local/bin:/usr/bin', 'HOME': '/srv/lorry', 'LOGNAME': 'lorry', 'USER': 'lorry', 'INVOCATION_ID': '3213f572a01648f39e23ca04a92b6da3', 'JOURNAL_STREAM': '9:332716'}), 'stdin': <_io.TextIOWrapper name='/dev/null' mode='r' encoding='UTF-8'>}
DEBUG run external command: [['git', '-c', 'gc.autodetach=false', 'fetch', '--prune', 'https://git.musl-libc.org/git/musl', '+refs/heads/*:refs/heads/*', '+refs/tags/*:refs/tags/*']]
DEBUG Command: ['git', '-c', 'gc.autodetach=false', 'fetch', '--prune', 'https://git.musl-libc.org/git/musl', '+refs/heads/*:refs/heads/*', '+refs/tags/*:refs/tags/*']
Exit: 128
Stdout:
Stderr:
    fatal: protocol error: bad line length character: erro

DEBUG Mirror of delta/musl failed, state before mirror is saved at /srv/lorry-working-area/delta_musl/git-a and state after mirror is saved at /srv/lorry-working-area/delta_musl/git-post-fail

Error mirroring:
Traceback (most recent call last):
  File "/usr/bin/lorry", line 262, in process_args
    self.gitify(name, specs[name])
  File "/usr/bin/lorry", line 375, in gitify
    table[vcstype](name, dirname, temp_repo, spec)
  File "/usr/bin/lorry", line 543, in mirror_git
    self.run_program(argv, cwd=gitdir, env=env)
  File "/usr/bin/lorry", line 868, in run_program
    raise Exception('%s failed (exit code %s):\n%s' %
Exception: git -c gc.autodetach=false fetch --prune https://git.musl-libc.org/git/musl +refs/heads/*:refs/heads/* +refs/tags/*:refs/tags/* failed (exit code 128):
    fatal: protocol error: bad line length character: erro

ERROR Traceback (most recent call last):
  File "/usr/bin/lorry", line 262, in process_args
    self.gitify(name, specs[name])
  File "/usr/bin/lorry", line 375, in gitify
    table[vcstype](name, dirname, temp_repo, spec)
  File "/usr/bin/lorry", line 543, in mirror_git
    self.run_program(argv, cwd=gitdir, env=env)
  File "/usr/bin/lorry", line 868, in run_program
    raise Exception('%s failed (exit code %s):\n%s' %
Exception: git -c gc.autodetach=false fetch --prune https://git.musl-libc.org/git/musl +refs/heads/*:refs/heads/* +refs/tags/*:refs/tags/* failed (exit code 128):
    fatal: protocol error: bad line length character: erro


DEBUG Total Mirrors failed: 1
DEBUG Done
Processing spec file /tmp/tmpsnk79u6m
Getting: delta/musl
Getting delta/musl
.. updating existing clone
Mirror of delta/musl failed, state before mirror is saved at /srv/lorry-working-area/delta_musl/git-a and state after mirror is saved at /srv/lorry-working-area/delta_musl/git-post-fail
Done

347 delta/apache/httpd 3 h in 39 min 38 s 0
348 delta/hostap 3 h in 39 min 39 s 0
349 delta/lcms2 3 h in 39 min 39 s 0
350 delta/m4-tarball 3 h in 39 min 39 s 0
351 delta/libgphoto2 3 h in 39 min 41 s 0
352 delta/lrexlib 3 h in 39 min 41 s 0
353 delta/make-tarball 3 h in 39 min 41 s 0
354 delta/make 3 h in 39 min 42 s
1: Show log

INFO lorry version 0.0 starts
DEBUG sys.argv: ['/usr/bin/lorry', '--config=/etc/lorry-controller/lorry.conf', '--config=/etc/lc-site/lorry-controller/lorry.conf', '/tmp/tmp1t_fq8mt']
DEBUG current working directory: /
DEBUG uid: 998
DEBUG effective uid: 998
DEBUG gid: 998
DEBUG effective gid: 998
DEBUG environment variables:
DEBUG environment: LANG=C.UTF-8
DEBUG environment: PATH=/usr/local/bin:/usr/bin
DEBUG environment: HOME=/srv/lorry
DEBUG environment: LOGNAME=lorry
DEBUG environment: USER=lorry
DEBUG environment: INVOCATION_ID=a94e6dd68c25466c9a694360b5c664ca
DEBUG environment: JOURNAL_STREAM=9:332723
DEBUG Config:
[config]
output = 
log = stderr
log-level = debug
log-max = 0
log-keep = 10
log-mode = 0600
dump-memory-profile = simple
memory-dump-interval = 300
working-area = /srv/lorry-working-area
mirror-base-url-push = /srv/lorry-depot
mirror-base-url-fetch = /srv/lorry-depot
pull-only = False
verbose = True
repack = True
command-stdout = None
command-stderr = None
bundle = never
bundle-dest = 
tarball = never
tarball-dest = 
keep-multiple-backups = False
push-option = 
bazaar-command = None
check-certificates = True


DEBUG Python version: 3.8.3 (default, Nov 10 2011, 15:00:00) 
[GCC 10.1.0]
DEBUG Processing spec file /tmp/tmp1t_fq8mt
DEBUG Getting: delta/make
DEBUG Getting delta/make
DEBUG Mirror of delta/make failed, state before mirror is saved at /srv/lorry-working-area/delta_make/git-a and state after mirror is saved at /srv/lorry-working-area/delta_make/git-post-fail

Error mirroring:
Traceback (most recent call last):
  File "/usr/bin/lorry", line 262, in process_args
    self.gitify(name, specs[name])
  File "/usr/bin/lorry", line 375, in gitify
    table[vcstype](name, dirname, temp_repo, spec)
  File "/usr/bin/lorry", line 547, in gitify_bzr
    if os.path.basename(bzr) == 'brz':
  File "/usr/lib/python3.8/posixpath.py", line 142, in basename
    p = os.fspath(p)
TypeError: expected str, bytes or os.PathLike object, not NoneType
ERROR Traceback (most recent call last):
  File "/usr/bin/lorry", line 262, in process_args
    self.gitify(name, specs[name])
  File "/usr/bin/lorry", line 375, in gitify
    table[vcstype](name, dirname, temp_repo, spec)
  File "/usr/bin/lorry", line 547, in gitify_bzr
    if os.path.basename(bzr) == 'brz':
  File "/usr/lib/python3.8/posixpath.py", line 142, in basename
    p = os.fspath(p)
TypeError: expected str, bytes or os.PathLike object, not NoneType

DEBUG Total Mirrors failed: 1
DEBUG Done
Processing spec file /tmp/tmp1t_fq8mt
Getting: delta/make
Getting delta/make
Mirror of delta/make failed, state before mirror is saved at /srv/lorry-working-area/delta_make/git-a and state after mirror is saved at /srv/lorry-working-area/delta_make/git-post-fail
Done

355 delta/libsoup 3 h in 39 min 43 s 0
356 delta/lua 3 h in 39 min 44 s 0
357 delta/libvorbis-git 3 h in 39 min 45 s 0
358 delta/lua-scrypt-git 3 h in 39 min 46 s 0
359 delta/python-packages/ruamel.yaml 3 h in 39 min 48 s 0
360 delta/gnome/libgweather 3 h in 39 min 52 s 0
361 delta/harfbuzz 3 h in 39 min 53 s 0
362 delta/makeself 3 h in 39 min 53 s 0
363 delta/mozilla/mozjs17 3 h in 39 min 54 s 0
364 delta/mercurial-tarball 3 h in 39 min 55 s 0
365 delta/ruby 3 h in 39 min 55 s 0
366 delta/luajit2 3 h in 39 min 56 s 0
367 delta/libxml2 3 h in 39 min 57 s 0
368 delta/haproxy 3 h in 39 min 59 s 0
369 delta/gnome/totem 3 h in 40 min 0
370 delta/iso-codes 3 h in 40 min 1 s
1: Show log

INFO lorry version 0.0 starts
DEBUG sys.argv: ['/usr/bin/lorry', '--config=/etc/lorry-controller/lorry.conf', '--config=/etc/lc-site/lorry-controller/lorry.conf', '/tmp/tmpmrdvt6iz']
DEBUG current working directory: /
DEBUG uid: 998
DEBUG effective uid: 998
DEBUG gid: 998
DEBUG effective gid: 998
DEBUG environment variables:
DEBUG environment: LANG=C.UTF-8
DEBUG environment: PATH=/usr/local/bin:/usr/bin
DEBUG environment: HOME=/srv/lorry
DEBUG environment: LOGNAME=lorry
DEBUG environment: USER=lorry
DEBUG environment: INVOCATION_ID=3213f572a01648f39e23ca04a92b6da3
DEBUG environment: JOURNAL_STREAM=9:332716
DEBUG Config:
[config]
output = 
log = stderr
log-level = debug
log-max = 0
log-keep = 10
log-mode = 0600
dump-memory-profile = simple
memory-dump-interval = 300
working-area = /srv/lorry-working-area
mirror-base-url-push = /srv/lorry-depot
mirror-base-url-fetch = /srv/lorry-depot
pull-only = False
verbose = True
repack = True
command-stdout = None
command-stderr = None
bundle = never
bundle-dest = 
tarball = never
tarball-dest = 
keep-multiple-backups = False
push-option = 
bazaar-command = None
check-certificates = True


DEBUG Python version: 3.8.3 (default, Nov 10 2011, 15:00:00) 
[GCC 10.1.0]
DEBUG Processing spec file /tmp/tmpmrdvt6iz
DEBUG Getting: delta/iso-codes
DEBUG Getting delta/iso-codes
DEBUG .. updating existing clone
DEBUG Running: argv=['git', '-c', 'gc.autodetach=false', 'fetch', '--prune', 'https://salsa.debian.org/debian/iso-codes.git', '+refs/heads/*:refs/heads/*', '+refs/tags/*:refs/tags/*'] kwargs={'cwd': '/srv/lorry-working-area/delta_iso-codes/git-a', 'env': environ({'LANG': 'C.UTF-8', 'PATH': '/usr/local/bin:/usr/bin', 'HOME': '/srv/lorry', 'LOGNAME': 'lorry', 'USER': 'lorry', 'INVOCATION_ID': '3213f572a01648f39e23ca04a92b6da3', 'JOURNAL_STREAM': '9:332716'}), 'stdin': <_io.TextIOWrapper name='/dev/null' mode='r' encoding='UTF-8'>}
DEBUG run external command: [['git', '-c', 'gc.autodetach=false', 'fetch', '--prune', 'https://salsa.debian.org/debian/iso-codes.git', '+refs/heads/*:refs/heads/*', '+refs/tags/*:refs/tags/*']]
DEBUG Command: ['git', '-c', 'gc.autodetach=false', 'fetch', '--prune', 'https://salsa.debian.org/debian/iso-codes.git', '+refs/heads/*:refs/heads/*', '+refs/tags/*:refs/tags/*']
Exit: 0
Stdout:
Stderr:

DEBUG .. repacking delta/iso-codes git repository
DEBUG Running: argv=['git', 'config', 'pack.windowMemory', '128M'] kwargs={'cwd': '/srv/lorry-working-area/delta_iso-codes/git-a', 'stdin': <_io.TextIOWrapper name='/dev/null' mode='r' encoding='UTF-8'>}
DEBUG run external command: [['git', 'config', 'pack.windowMemory', '128M']]
DEBUG Command: ['git', 'config', 'pack.windowMemory', '128M']
Exit: 0
Stdout:
Stderr:

DEBUG Running: argv=['git', 'gc'] kwargs={'cwd': '/srv/lorry-working-area/delta_iso-codes/git-a', 'stdin': <_io.TextIOWrapper name='/dev/null' mode='r' encoding='UTF-8'>}
DEBUG run external command: [['git', 'gc']]
DEBUG Command: ['git', 'gc']
Exit: 0
Stdout:
Stderr:

DEBUG .. pushing delta/iso-codes to mirror server /srv/lorry-depot/delta/iso-codes.git
DEBUG Running: argv=['git', 'push', '/srv/lorry-depot/delta/iso-codes.git', '+refs/heads/*', '+refs/tags/*'] kwargs={'cwd': '/srv/lorry-working-area/delta_iso-codes/git-a', 'stdin': <_io.TextIOWrapper name='/dev/null' mode='r' encoding='UTF-8'>}
DEBUG run external command: [['git', 'push', '/srv/lorry-depot/delta/iso-codes.git', '+refs/heads/*', '+refs/tags/*']]
DEBUG Command: ['git', 'push', '/srv/lorry-depot/delta/iso-codes.git', '+refs/heads/*', '+refs/tags/*']
Exit: 1
Stdout:
Stderr:
    remote: error: cannot lock ref 'refs/heads/upstream/latest': 'refs/heads/upstream' exists; cannot create 'refs/heads/upstream/latest'        
    To /srv/lorry-depot/delta/iso-codes.git
     ! [remote rejected] upstream/latest -> upstream/latest (failed to update ref)
    error: failed to push some refs to '/srv/lorry-depot/delta/iso-codes.git'

Error mirroring:
Traceback (most recent call last):
  File "/usr/bin/lorry", line 262, in process_args
    self.gitify(name, specs[name])
  File "/usr/bin/lorry", line 406, in gitify
    self.push_to_mirror_server(name, active_repo, spec['refspecs'])
  File "/usr/bin/lorry", line 844, in push_to_mirror_server
    self.run_program(['git', 'push']
  File "/usr/bin/lorry", line 868, in run_program
    raise Exception('%s failed (exit code %s):\n%s' %
Exception: git push /srv/lorry-depot/delta/iso-codes.git +refs/heads/* +refs/tags/* failed (exit code 1):
    remote: error: cannot lock ref 'refs/heads/upstream/latest': 'refs/heads/upstream' exists; cannot create 'refs/heads/upstream/latest'        
    To /srv/lorry-depot/delta/iso-codes.git
     ! [remote rejected] upstream/latest -> upstream/latest (failed to update ref)
    error: failed to push some refs to '/srv/lorry-depot/delta/iso-codes.git'

ERROR Traceback (most recent call last):
  File "/usr/bin/lorry", line 262, in process_args
    self.gitify(name, specs[name])
  File "/usr/bin/lorry", line 406, in gitify
    self.push_to_mirror_server(name, active_repo, spec['refspecs'])
  File "/usr/bin/lorry", line 844, in push_to_mirror_server
    self.run_program(['git', 'push']
  File "/usr/bin/lorry", line 868, in run_program
    raise Exception('%s failed (exit code %s):\n%s' %
Exception: git push /srv/lorry-depot/delta/iso-codes.git +refs/heads/* +refs/tags/* failed (exit code 1):
    remote: error: cannot lock ref 'refs/heads/upstream/latest': 'refs/heads/upstream' exists; cannot create 'refs/heads/upstream/latest'        
    To /srv/lorry-depot/delta/iso-codes.git
     ! [remote rejected] upstream/latest -> upstream/latest (failed to update ref)
    error: failed to push some refs to '/srv/lorry-depot/delta/iso-codes.git'


DEBUG Total Mirrors failed: 1
DEBUG Done
Processing spec file /tmp/tmpmrdvt6iz
Getting: delta/iso-codes
Getting delta/iso-codes
.. updating existing clone
.. repacking delta/iso-codes git repository
.. pushing delta/iso-codes to mirror server /srv/lorry-depot/delta/iso-codes.git
Done

371 delta/libapr-util 3 h in 40 min 2 s 0
372 delta/librsvg 3 h in 40 min 4 s 0
373 delta/lighttpd-git 3 h in 40 min 5 s 0
374 delta/openstack/nova 3 h in 40 min 6 s 0
375 delta/isc-dhcp 3 h in 40 min 8 s 0
376 delta/gnome/gedit 3 h in 40 min 11 s 0
377 delta/coreboot/chrome-ec 3 h in 40 min 13 s 0
378 delta/gstreamer 3 h in 40 min 14 s 0
379 delta/gstreamer-plugins-base 3 h in 40 min 16 s 0
380 delta/gnome/gnome-shell 3 h in 40 min 18 s 0
381 delta/gnome/tracker 3 h in 40 min 18 s 0
382 delta/u-boot-socfpga 3 h in 40 min 19 s 0
383 delta/luxio 3 h in 40 min 20 s 0
384 delta/mtdev 3 h in 40 min 20 s 0
385 delta/mtools 3 h in 40 min 21 s 0
386 delta/libapr 3 h in 40 min 22 s 0
387 delta/gnome/epiphany 3 h in 40 min 28 s 0
388 delta/cmake 3 h in 40 min 33 s 0
389 delta/markupsafe 3 h in 40 min 34 s 0
390 delta/rust-libc 3 h in 40 min 35 s 0
391 delta/u-boot-odroid-c1 3 h in 40 min 35 s 0
392 delta/mdadm 3 h in 40 min 36 s 0
393 delta/libgit2 3 h in 40 min 39 s 0
394 delta/gstreamer-plugins-good 3 h in 40 min 40 s 0
395 delta/mtdev-git 3 h in 40 min 40 s 0
396 delta/bundler 3 h in 40 min 41 s 0
397 delta/nano-tarball 3 h in 40 min 41 s 0
398 delta/nspr 3 h in 40 min 41 s 0
399 delta/lm-sensors-git 3 h in 40 min 44 s 0
400 delta/libpng 3 h in 40 min 47 s 0
401 delta/perl 3 h in 40 min 54 s 0
402 delta/mozilla/mozjs24 3 h in 40 min 55 s 0
403 delta/qemu 3 h in 40 min 59 s 0
404 delta/qt5/qtbase 3 h in 41 min 4 s 0
405 delta/gpsd 3 h in 41 min 9 s 0
406 delta/m4-common 3 h in 41 min 11 s 0
407 delta/lua-github 3 h in 41 min 13 s 0
408 delta/mobile-broadband-provider-info 3 h in 41 min 15 s 0
409 delta/log4cxx 3 h in 41 min 17 s 0
410 delta/m4 3 h in 41 min 19 s 0
411 delta/memcached 3 h in 41 min 20 s 0
412 delta/guile 3 h in 41 min 24 s 0
413 delta/krb5 3 h in 41 min 25 s 0
414 delta/mm-common 3 h in 41 min 26 s 0
415 delta/mpc-git 3 h in 41 min 28 s 0
416 delta/java/ant 3 h in 41 min 31 s 0
417 delta/libvpx 3 h in 41 min 34 s 0
418 delta/gnutls 3 h in 41 min 36 s 0
419 delta/ansible 3 h in 42 min 6 s 0
420 delta/moreutils 3 h in 42 min 8 s 0
421 delta/mustache-spec 3 h in 42 min 8 s 0
422 delta/ncurses 3 h in 42 min 9 s 0
423 delta/mtd-utils 3 h in 42 min 12 s 0
424 delta/nanomsg 3 h in 42 min 13 s 0
425 delta/qt4-tools 3 h in 42 min 24 s 0
426 delta/postgresql 3 h in 42 min 32 s 0
427 delta/neon-git 3 h in 42 min 36 s 0
428 delta/net-dhcp-ruby 3 h in 42 min 37 s 0
429 delta/make-git 3 h in 42 min 59 s 0
430 delta/nautilus-sendto 3 h in 43 min 1 s 0
431 delta/netsurf/libnsfb 3 h in 43 min 36 s 0
432 delta/netsurf/buildsystem 3 h in 43 min 39 s 0
433 delta/netsurf/libhubbub 3 h in 43 min 41 s 0
434 delta/jerasure 3 h in 43 min 42 s
1: Show log

INFO lorry version 0.0 starts
DEBUG sys.argv: ['/usr/bin/lorry', '--config=/etc/lorry-controller/lorry.conf', '--config=/etc/lc-site/lorry-controller/lorry.conf', '/tmp/tmpa9szi5eg']
DEBUG current working directory: /
DEBUG uid: 998
DEBUG effective uid: 998
DEBUG gid: 998
DEBUG effective gid: 998
DEBUG environment variables:
DEBUG environment: LANG=C.UTF-8
DEBUG environment: PATH=/usr/local/bin:/usr/bin
DEBUG environment: HOME=/srv/lorry
DEBUG environment: LOGNAME=lorry
DEBUG environment: USER=lorry
DEBUG environment: INVOCATION_ID=a94e6dd68c25466c9a694360b5c664ca
DEBUG environment: JOURNAL_STREAM=9:332723
DEBUG Config:
[config]
output = 
log = stderr
log-level = debug
log-max = 0
log-keep = 10
log-mode = 0600
dump-memory-profile = simple
memory-dump-interval = 300
working-area = /srv/lorry-working-area
mirror-base-url-push = /srv/lorry-depot
mirror-base-url-fetch = /srv/lorry-depot
pull-only = False
verbose = True
repack = True
command-stdout = None
command-stderr = None
bundle = never
bundle-dest = 
tarball = never
tarball-dest = 
keep-multiple-backups = False
push-option = 
bazaar-command = None
check-certificates = True


DEBUG Python version: 3.8.3 (default, Nov 10 2011, 15:00:00) 
[GCC 10.1.0]
DEBUG Processing spec file /tmp/tmpa9szi5eg
DEBUG Getting: delta/jerasure
DEBUG Getting delta/jerasure
DEBUG .. updating existing clone
DEBUG Running: argv=['git', '-c', 'gc.autodetach=false', 'fetch', '--prune', 'http://lab.jerasure.org/jerasure/jerasure.git', '+refs/heads/*:refs/heads/*', '+refs/tags/*:refs/tags/*'] kwargs={'cwd': '/srv/lorry-working-area/delta_jerasure/git-b', 'env': environ({'LANG': 'C.UTF-8', 'PATH': '/usr/local/bin:/usr/bin', 'HOME': '/srv/lorry', 'LOGNAME': 'lorry', 'USER': 'lorry', 'INVOCATION_ID': 'a94e6dd68c25466c9a694360b5c664ca', 'JOURNAL_STREAM': '9:332723'}), 'stdin': <_io.TextIOWrapper name='/dev/null' mode='r' encoding='UTF-8'>}
DEBUG run external command: [['git', '-c', 'gc.autodetach=false', 'fetch', '--prune', 'http://lab.jerasure.org/jerasure/jerasure.git', '+refs/heads/*:refs/heads/*', '+refs/tags/*:refs/tags/*']]
DEBUG Command: ['git', '-c', 'gc.autodetach=false', 'fetch', '--prune', 'http://lab.jerasure.org/jerasure/jerasure.git', '+refs/heads/*:refs/heads/*', '+refs/tags/*:refs/tags/*']
Exit: 128
Stdout:
Stderr:
    fatal: unable to update url base from redirection:
      asked for: http://lab.jerasure.org/jerasure/jerasure.git/info/refs?service=git-upload-pack
       redirect: https://jerasure.org/

DEBUG Mirror of delta/jerasure failed, state before mirror is saved at /srv/lorry-working-area/delta_jerasure/git-a and state after mirror is saved at /srv/lorry-working-area/delta_jerasure/git-post-fail

Error mirroring:
Traceback (most recent call last):
  File "/usr/bin/lorry", line 262, in process_args
    self.gitify(name, specs[name])
  File "/usr/bin/lorry", line 375, in gitify
    table[vcstype](name, dirname, temp_repo, spec)
  File "/usr/bin/lorry", line 543, in mirror_git
    self.run_program(argv, cwd=gitdir, env=env)
  File "/usr/bin/lorry", line 868, in run_program
    raise Exception('%s failed (exit code %s):\n%s' %
Exception: git -c gc.autodetach=false fetch --prune http://lab.jerasure.org/jerasure/jerasure.git +refs/heads/*:refs/heads/* +refs/tags/*:refs/tags/* failed (exit code 128):
    fatal: unable to update url base from redirection:
      asked for: http://lab.jerasure.org/jerasure/jerasure.git/info/refs?service=git-upload-pack
       redirect: https://jerasure.org/

ERROR Traceback (most recent call last):
  File "/usr/bin/lorry", line 262, in process_args
    self.gitify(name, specs[name])
  File "/usr/bin/lorry", line 375, in gitify
    table[vcstype](name, dirname, temp_repo, spec)
  File "/usr/bin/lorry", line 543, in mirror_git
    self.run_program(argv, cwd=gitdir, env=env)
  File "/usr/bin/lorry", line 868, in run_program
    raise Exception('%s failed (exit code %s):\n%s' %
Exception: git -c gc.autodetach=false fetch --prune http://lab.jerasure.org/jerasure/jerasure.git +refs/heads/*:refs/heads/* +refs/tags/*:refs/tags/* failed (exit code 128):
    fatal: unable to update url base from redirection:
      asked for: http://lab.jerasure.org/jerasure/jerasure.git/info/refs?service=git-upload-pack
       redirect: https://jerasure.org/


DEBUG Total Mirrors failed: 1
DEBUG Done
Processing spec file /tmp/tmpa9szi5eg
Getting: delta/jerasure
Getting delta/jerasure
.. updating existing clone
Mirror of delta/jerasure failed, state before mirror is saved at /srv/lorry-working-area/delta_jerasure/git-a and state after mirror is saved at /srv/lorry-working-area/delta_jerasure/git-post-fail
Done

435 delta/netsurf/libnsbmp 3 h in 43 min 43 s 0
436 delta/netaddr 3 h in 43 min 44 s 0
437 delta/netsurf/librosprite 3 h in 43 min 45 s 0
438 delta/nasm 3 h in 43 min 46 s 0
439 delta/netsurf/libsvgtiny 3 h in 43 min 47 s 0
440 delta/netsurf/libdom 3 h in 43 min 48 s 0
441 delta/netsurf/libparserutils 3 h in 43 min 48 s 0
442 delta/netsurf/libnsgif 3 h in 43 min 49 s 0
443 delta/netsurf/libwapcaplet 3 h in 43 min 50 s 0
444 delta/ntp 3 h in 43 min 50 s 0
445 delta/netsurf/libcss 3 h in 43 min 51 s 0
446 delta/netsurf/nsgenjsbind 3 h in 43 min 51 s 0
447 delta/ninka 3 h in 43 min 52 s 0
448 delta/node-startup-controller 3 h in 43 min 53 s 0
449 delta/linuxquota 3 h in 43 min 54 s 0
450 delta/ninja 3 h in 43 min 54 s 0
451 delta/nss 3 h in 43 min 55 s 0
452 delta/node-state-manager 3 h in 43 min 56 s 0
453 delta/npm-packages/yamljs 3 h in 43 min 57 s 0
454 delta/mesa-demos 3 h in 43 min 59 s 0
455 delta/numpydoc 3 h in 44 min 0
456 delta/metacity 3 h in 44 min 1 s 0
457 delta/lvm2 3 h in 44 min 3 s 0
458 delta/gnome/adwaita-icon-theme 3 h in 44 min 5 s 0
459 delta/glib 3 h in 44 min 7 s 0
460 delta/gstreamer-plugins-bad 3 h in 44 min 8 s 0
461 delta/gnome/gnome-control-center 3 h in 44 min 10 s 0
462 delta/gnome/gnome-user-docs 3 h in 44 min 12 s 0
463 delta/u-boot 3 h in 45 min 3 s 0
464 delta/gdk-pixbuf 3 h in 45 min 8 s 0
465 delta/qt-creator 3 h in 45 min 8 s 0
466 delta/gnulib 3 h in 45 min 11 s 0
467 delta/python-packages/passlib 3 h in 46 min 3 s 0
468 delta/nvidia/cbootimage 3 h in 46 min 18 s 0
469 delta/nvidia/cbootimage-configs 3 h in 46 min 20 s 0
470 delta/python-packages/logilab-common 3 h in 47 min 20 s 0
471 delta/nvidia/tegra-uboot-flasher-scripts 3 h in 47 min 43 s 0
472 delta/obexd 3 h in 47 min 44 s 0
473 delta/nvidia/tegra-pinmux-scripts 3 h in 47 min 45 s 0
474 delta/novnc 3 h in 47 min 46 s 0
475 delta/nvidia/tegrarcm 3 h in 47 min 47 s 0
476 delta/openstack/ceilometermiddleware 3 h in 47 min 47 s 0
477 delta/nouveau 3 h in 47 min 48 s 0
478 delta/openstack/openstack-ansible-modules 3 h in 47 min 48 s 0
479 delta/npm-packages/async 3 h in 48 min 19 s 0
480 delta/ofono 3 h in 48 min 20 s 0
481 delta/open-iscsi 3 h in 48 min 22 s 0
482 delta/nettle 3 h in 48 min 23 s 0
483 delta/nfs-utils 3 h in 48 min 25 s 0
484 delta/openstack/heat-cfntools 3 h in 48 min 25 s 0
485 delta/ogg-git 3 h in 48 min 28 s 0
486 delta/openstack/django_openstack_auth 3 h in 48 min 30 s 0
487 delta/openstack/heat-templates 3 h in 48 min 33 s 0
488 delta/meson 3 h in 48 min 34 s 0
489 delta/nginx 3 h in 48 min 37 s 0
490 delta/openstack/cliff 3 h in 48 min 39 s 0
491 delta/gcc-tarball 3 h in 49 min 16 s 0
492 delta/mpfr 3 h in 49 min 19 s 0
493 delta/netsurf/netsurf 3 h in 49 min 48 s 0
494 delta/nohands 3 h in 49 min 52 s
1: Show log

INFO lorry version 0.0 starts
DEBUG sys.argv: ['/usr/bin/lorry', '--config=/etc/lorry-controller/lorry.conf', '--config=/etc/lc-site/lorry-controller/lorry.conf', '/tmp/tmpkps341rf']
DEBUG current working directory: /
DEBUG uid: 998
DEBUG effective uid: 998
DEBUG gid: 998
DEBUG effective gid: 998
DEBUG environment variables:
DEBUG environment: LANG=C.UTF-8
DEBUG environment: PATH=/usr/local/bin:/usr/bin
DEBUG environment: HOME=/srv/lorry
DEBUG environment: LOGNAME=lorry
DEBUG environment: USER=lorry
DEBUG environment: INVOCATION_ID=a94e6dd68c25466c9a694360b5c664ca
DEBUG environment: JOURNAL_STREAM=9:332723
DEBUG Config:
[config]
output = 
log = stderr
log-level = debug
log-max = 0
log-keep = 10
log-mode = 0600
dump-memory-profile = simple
memory-dump-interval = 300
working-area = /srv/lorry-working-area
mirror-base-url-push = /srv/lorry-depot
mirror-base-url-fetch = /srv/lorry-depot
pull-only = False
verbose = True
repack = True
command-stdout = None
command-stderr = None
bundle = never
bundle-dest = 
tarball = never
tarball-dest = 
keep-multiple-backups = False
push-option = 
bazaar-command = None
check-certificates = True


DEBUG Python version: 3.8.3 (default, Nov 10 2011, 15:00:00) 
[GCC 10.1.0]
DEBUG Processing spec file /tmp/tmpkps341rf
DEBUG Getting: delta/nohands
DEBUG Getting delta/nohands
DEBUG .. updating existing clone
DEBUG Running: argv=['git', 'config', 'svn-remote.svn.url', 'https://svn.code.sf.net/p/nohands/code/'] kwargs={'cwd': '/srv/lorry-working-area/delta_nohands/git-b', 'stdin': <_io.TextIOWrapper name='/dev/null' mode='r' encoding='UTF-8'>}
DEBUG run external command: [['git', 'config', 'svn-remote.svn.url', 'https://svn.code.sf.net/p/nohands/code/']]
DEBUG Command: ['git', 'config', 'svn-remote.svn.url', 'https://svn.code.sf.net/p/nohands/code/']
Exit: 0
Stdout:
Stderr:

DEBUG Running: argv=['git', 'config', 'svn-remote.svn.fetch', ':refs/remotes/git-svn'] kwargs={'cwd': '/srv/lorry-working-area/delta_nohands/git-b', 'stdin': <_io.TextIOWrapper name='/dev/null' mode='r' encoding='UTF-8'>}
DEBUG run external command: [['git', 'config', 'svn-remote.svn.fetch', ':refs/remotes/git-svn']]
DEBUG Command: ['git', 'config', 'svn-remote.svn.fetch', ':refs/remotes/git-svn']
Exit: 0
Stdout:
Stderr:

DEBUG Running: argv=['git', 'config', 'svn-remote.svn.fetch', 'trunk:refs/heads/master'] kwargs={'cwd': '/srv/lorry-working-area/delta_nohands/git-b', 'stdin': <_io.TextIOWrapper name='/dev/null' mode='r' encoding='UTF-8'>}
DEBUG run external command: [['git', 'config', 'svn-remote.svn.fetch', 'trunk:refs/heads/master']]
DEBUG Command: ['git', 'config', 'svn-remote.svn.fetch', 'trunk:refs/heads/master']
Exit: 0
Stdout:
Stderr:

DEBUG Running: argv=['git', 'config', 'svn-remote.svn.branches', 'branches/*:refs/heads/*'] kwargs={'cwd': '/srv/lorry-working-area/delta_nohands/git-b', 'stdin': <_io.TextIOWrapper name='/dev/null' mode='r' encoding='UTF-8'>}
DEBUG run external command: [['git', 'config', 'svn-remote.svn.branches', 'branches/*:refs/heads/*']]
DEBUG Command: ['git', 'config', 'svn-remote.svn.branches', 'branches/*:refs/heads/*']
Exit: 0
Stdout:
Stderr:

DEBUG Running: argv=['git', 'config', 'svn-remote.svn.tags', 'tags/*:refs/tags/*'] kwargs={'cwd': '/srv/lorry-working-area/delta_nohands/git-b', 'stdin': <_io.TextIOWrapper name='/dev/null' mode='r' encoding='UTF-8'>}
DEBUG run external command: [['git', 'config', 'svn-remote.svn.tags', 'tags/*:refs/tags/*']]
DEBUG Command: ['git', 'config', 'svn-remote.svn.tags', 'tags/*:refs/tags/*']
Exit: 0
Stdout:
Stderr:

DEBUG Running: argv=['git', 'svn', 'fetch'] kwargs={'cwd': '/srv/lorry-working-area/delta_nohands/git-b', 'stdin': <_io.TextIOWrapper name='/dev/null' mode='r' encoding='UTF-8'>}
DEBUG run external command: [['git', 'svn', 'fetch']]
DEBUG Command: ['git', 'svn', 'fetch']
Exit: 1
Stdout:
    Rebuilding svn/refs/heads/master/.rev_map.126591fb-c623-4b62-a76d-97a8e4f34109 ...
    Done rebuilding svn/refs/heads/master/.rev_map.126591fb-c623-4b62-a76d-97a8e4f34109
    Rebuilding svn/refs/heads/master/.rev_map.126591fb-c623-4b62-a76d-97a8e4f34109 ...
    Done rebuilding svn/refs/heads/master/.rev_map.126591fb-c623-4b62-a76d-97a8e4f34109
    Rebuilding svn/refs/heads/master/.rev_map.126591fb-c623-4b62-a76d-97a8e4f34109 ...
    Done rebuilding svn/refs/heads/master/.rev_map.126591fb-c623-4b62-a76d-97a8e4f34109
    Rebuilding svn/refs/heads/master/.rev_map.126591fb-c623-4b62-a76d-97a8e4f34109 ...
    Done rebuilding svn/refs/heads/master/.rev_map.126591fb-c623-4b62-a76d-97a8e4f34109
    	D	test/pumpunit.cpp
    	D	m4/acx_pthread.m4
    	D	include/Makefile.am
    	D	include/libhfp/Makefile.am
    	D	qt/hfstandalone.cpp
    	D	libhfp/events.cpp
    	M	test/Makefile.am
    	M	test/soundtest.cpp
    	D	data/hangup.png
    	D	data/signal-3.png
    	D	data/signal-2.png
    	D	data/signal-1.png
    	D	data/signal-0.png
    	D	data/pickup.png
    	D	data/signal-4.png
    	D	data/signal-5.png
    	D	data/noag.png
    	D	data/signal-none.png
    	D	data/nobt.png
    	D	data/icon.png
    	D	data/agconnect.png
    	D	data/mute.png
    	D	data/battery-1.png
    	D	data/Doxyfile.dbus
    	D	data/battery-3.png
    	D	data/battery-5.png
    	D	data/doxymain.h
    	D	data/hfconsole_ring.wav
    	D	data/contacts.png
    	D	data/holdcall.png
    	D	data/message.png
    	D	data/swapcall.png
    	D	data/vr.png
    	D	data/iconsrc/agconnect.svg
    	D	data/iconsrc/audioconnect.svg
    	D	data/iconsrc/battery-0.svg
    	D	data/iconsrc/battery-1.svg
    	D	data/iconsrc/battery-2.svg
    	D	data/iconsrc/battery-3.svg
    	D	data/iconsrc/battery-4.svg
    	D	data/iconsrc/battery-5.svg
    	D	data/iconsrc/contacts.svg
    	D	data/iconsrc/dialpad.svg
    	D	data/iconsrc/handset.svg
    	D	data/iconsrc/hangup.svg
    	D	data/iconsrc/holdcall.svg
    	D	data/iconsrc/logomain.svg
    	D	data/iconsrc/message.svg
    	D	data/iconsrc/mute.svg
    	D	data/iconsrc/noag.svg
    	D	data/iconsrc/nobt.svg
    	D	data/iconsrc/pickup.svg
    	D	data/iconsrc/redial.svg
    	D	data/iconsrc/signal-0.svg
    	D	data/iconsrc/signal-1.svg
    	D	data/iconsrc/signal-2.svg
    	D	data/iconsrc/signal-3.svg
    	D	data/iconsrc/signal-4.svg
    	D	data/iconsrc/signal-5.svg
    	D	data/iconsrc/signal-none.svg
    	D	data/iconsrc/signal-proto.svg
    	D	data/iconsrc/signal.svg
    	D	data/iconsrc/swapcall.svg
    	D	data/iconsrc/tel-cell.svg
    	D	data/iconsrc/vr.svg
    	D	data/iconsrc/
    	D	data/tel-cell.png
    	D	data/battery-0.png
    	D	data/battery-2.png
    	D	data/battery-4.png
    	D	data/redial.png
    	D	data/signal.png
    	D	data/hfpd-dbus-doc.cs
    	D	data/dialpad.png
    	D	data/audioconnect.png
    	M	libhfp/soundio-oss.cpp
    	M	libhfp/bt.cpp
    	M	libhfp/soundio-util.cpp
    	M	qt/Makefile.am
    	M	qt/nohands.ui.h
    	M	configure.in
    	M	libhfp/soundio-alsa.cpp
    	M	libhfp/events-indep.cpp
    	M	libhfp/rfcomm.cpp
    	M	m4/doxy.m4
    	M	hfpd/objects.h
    	M	hfpd/hfpd.cpp
    	M	hfpd/util.h
    	M	hfpd/configfile.cpp
    	M	hfpd/net.cpp
    	M	hfpd/Makefile.am
    	M	hfpd/proto.h
    	M	libhfp/Makefile.am
    	M	hfpd/objects.cpp
    	M	hfpd/configfile.h
    	M	hfpd/util.cpp
    	M	hfpd/dbus.cpp
    	M	include/libhfp/soundio-buf.h
    	M	include/libhfp/hfp.h
    	M	include/libhfp/soundio.h
    	M	include/libhfp/events-indep.h
    	M	include/libhfp/rfcomm.h
    	M	include/libhfp/events.h
    	M	include/libhfp/bt.h
    	M	Doxyfile
    	M	qt/prefs.ui.h
    	M	qt/nohands.ui
    	M	qt/scandialog.ui.h
    	A	data/dsp-sidebar.png
    	M	data/hfconsole.in
    	M	data/Makefile.am
    	M	Makefile.am
    	M	nhandsfree/Makefile.am
    	M	nhandsfree/nhandsfree.cpp
    	A	qt/standalone.cpp
    	M	qt/events-qt.h
    	M	README
    	M	libhfp/soundio-pump.cpp
    	M	libhfp/oplatency.h
    	M	libhfp/soundio-manager.cpp
    	M	libhfp/hfp.cpp
    	M	data/hfconsole.glade
    	A	doxymain.h
Stderr:
    W: -empty_dir: trunk/data/Doxyfile.dbus
    W: -empty_dir: trunk/data/agconnect.png
    W: -empty_dir: trunk/data/audioconnect.png
    W: -empty_dir: trunk/data/battery-0.png
    W: -empty_dir: trunk/data/battery-1.png
    W: -empty_dir: trunk/data/battery-2.png
    W: -empty_dir: trunk/data/battery-3.png
    W: -empty_dir: trunk/data/battery-4.png
    W: -empty_dir: trunk/data/battery-5.png
    W: -empty_dir: trunk/data/contacts.png
    W: -empty_dir: trunk/data/dialpad.png
    W: -empty_dir: trunk/data/doxymain.h
    W: -empty_dir: trunk/data/hangup.png
    W: -empty_dir: trunk/data/hfconsole_ring.wav
    W: -empty_dir: trunk/data/hfpd-dbus-doc.cs
    W: -empty_dir: trunk/data/holdcall.png
    W: -empty_dir: trunk/data/icon.png
    W: -empty_dir: trunk/data/iconsrc
    W: -empty_dir: trunk/data/message.png
    W: -empty_dir: trunk/data/mute.png
    W: -empty_dir: trunk/data/noag.png
    W: -empty_dir: trunk/data/nobt.png
    W: -empty_dir: trunk/data/pickup.png
    W: -empty_dir: trunk/data/redial.png
    W: -empty_dir: trunk/data/signal-0.png
    W: -empty_dir: trunk/data/signal-1.png
    W: -empty_dir: trunk/data/signal-2.png
    W: -empty_dir: trunk/data/signal-3.png
    W: -empty_dir: trunk/data/signal-4.png
    W: -empty_dir: trunk/data/signal-5.png
    W: -empty_dir: trunk/data/signal-none.png
    W: -empty_dir: trunk/data/signal.png
    W: -empty_dir: trunk/data/swapcall.png
    W: -empty_dir: trunk/data/tel-cell.png
    W: -empty_dir: trunk/data/vr.png
    W: -empty_dir: trunk/include/Makefile.am
    W: -empty_dir: trunk/include/libhfp/Makefile.am
    W: -empty_dir: trunk/libhfp/events.cpp
    W: -empty_dir: trunk/m4/acx_pthread.m4
    W: -empty_dir: trunk/qt/hfstandalone.cpp
    W: -empty_dir: trunk/test/pumpunit.cpp
    Last fetched revision of refs/heads/master was r88, but we are about to fetch: r1!
    

DEBUG Mirror of delta/nohands failed, state before mirror is saved at /srv/lorry-working-area/delta_nohands/git-a and state after mirror is saved at /srv/lorry-working-area/delta_nohands/git-post-fail

Error mirroring:
Traceback (most recent call last):
  File "/usr/bin/lorry", line 262, in process_args
    self.gitify(name, specs[name])
  File "/usr/bin/lorry", line 375, in gitify
    table[vcstype](name, dirname, temp_repo, spec)
  File "/usr/bin/lorry", line 676, in gitify_svn
    self.run_program(['git', 'svn', 'fetch'], cwd=gitdir)
  File "/usr/bin/lorry", line 868, in run_program
    raise Exception('%s failed (exit code %s):\n%s' %
Exception: git svn fetch failed (exit code 1):
    W: -empty_dir: trunk/data/Doxyfile.dbus
    W: -empty_dir: trunk/data/agconnect.png
    W: -empty_dir: trunk/data/audioconnect.png
    W: -empty_dir: trunk/data/battery-0.png
    W: -empty_dir: trunk/data/battery-1.png
    W: -empty_dir: trunk/data/battery-2.png
    W: -empty_dir: trunk/data/battery-3.png
    W: -empty_dir: trunk/data/battery-4.png
    W: -empty_dir: trunk/data/battery-5.png
    W: -empty_dir: trunk/data/contacts.png
    W: -empty_dir: trunk/data/dialpad.png
    W: -empty_dir: trunk/data/doxymain.h
    W: -empty_dir: trunk/data/hangup.png
    W: -empty_dir: trunk/data/hfconsole_ring.wav
    W: -empty_dir: trunk/data/hfpd-dbus-doc.cs
    W: -empty_dir: trunk/data/holdcall.png
    W: -empty_dir: trunk/data/icon.png
    W: -empty_dir: trunk/data/iconsrc
    W: -empty_dir: trunk/data/message.png
    W: -empty_dir: trunk/data/mute.png
    W: -empty_dir: trunk/data/noag.png
    W: -empty_dir: trunk/data/nobt.png
    W: -empty_dir: trunk/data/pickup.png
    W: -empty_dir: trunk/data/redial.png
    W: -empty_dir: trunk/data/signal-0.png
    W: -empty_dir: trunk/data/signal-1.png
    W: -empty_dir: trunk/data/signal-2.png
    W: -empty_dir: trunk/data/signal-3.png
    W: -empty_dir: trunk/data/signal-4.png
    W: -empty_dir: trunk/data/signal-5.png
    W: -empty_dir: trunk/data/signal-none.png
    W: -empty_dir: trunk/data/signal.png
    W: -empty_dir: trunk/data/swapcall.png
    W: -empty_dir: trunk/data/tel-cell.png
    W: -empty_dir: trunk/data/vr.png
    W: -empty_dir: trunk/include/Makefile.am
    W: -empty_dir: trunk/include/libhfp/Makefile.am
    W: -empty_dir: trunk/libhfp/events.cpp
    W: -empty_dir: trunk/m4/acx_pthread.m4
    W: -empty_dir: trunk/qt/hfstandalone.cpp
    W: -empty_dir: trunk/test/pumpunit.cpp
    Last fetched revision of refs/heads/master was r88, but we are about to fetch: r1!
    

ERROR Traceback (most recent call last):
  File "/usr/bin/lorry", line 262, in process_args
    self.gitify(name, specs[name])
  File "/usr/bin/lorry", line 375, in gitify
    table[vcstype](name, dirname, temp_repo, spec)
  File "/usr/bin/lorry", line 676, in gitify_svn
    self.run_program(['git', 'svn', 'fetch'], cwd=gitdir)
  File "/usr/bin/lorry", line 868, in run_program
    raise Exception('%s failed (exit code %s):\n%s' %
Exception: git svn fetch failed (exit code 1):
    W: -empty_dir: trunk/data/Doxyfile.dbus
    W: -empty_dir: trunk/data/agconnect.png
    W: -empty_dir: trunk/data/audioconnect.png
    W: -empty_dir: trunk/data/battery-0.png
    W: -empty_dir: trunk/data/battery-1.png
    W: -empty_dir: trunk/data/battery-2.png
    W: -empty_dir: trunk/data/battery-3.png
    W: -empty_dir: trunk/data/battery-4.png
    W: -empty_dir: trunk/data/battery-5.png
    W: -empty_dir: trunk/data/contacts.png
    W: -empty_dir: trunk/data/dialpad.png
    W: -empty_dir: trunk/data/doxymain.h
    W: -empty_dir: trunk/data/hangup.png
    W: -empty_dir: trunk/data/hfconsole_ring.wav
    W: -empty_dir: trunk/data/hfpd-dbus-doc.cs
    W: -empty_dir: trunk/data/holdcall.png
    W: -empty_dir: trunk/data/icon.png
    W: -empty_dir: trunk/data/iconsrc
    W: -empty_dir: trunk/data/message.png
    W: -empty_dir: trunk/data/mute.png
    W: -empty_dir: trunk/data/noag.png
    W: -empty_dir: trunk/data/nobt.png
    W: -empty_dir: trunk/data/pickup.png
    W: -empty_dir: trunk/data/redial.png
    W: -empty_dir: trunk/data/signal-0.png
    W: -empty_dir: trunk/data/signal-1.png
    W: -empty_dir: trunk/data/signal-2.png
    W: -empty_dir: trunk/data/signal-3.png
    W: -empty_dir: trunk/data/signal-4.png
    W: -empty_dir: trunk/data/signal-5.png
    W: -empty_dir: trunk/data/signal-none.png
    W: -empty_dir: trunk/data/signal.png
    W: -empty_dir: trunk/data/swapcall.png
    W: -empty_dir: trunk/data/tel-cell.png
    W: -empty_dir: trunk/data/vr.png
    W: -empty_dir: trunk/include/Makefile.am
    W: -empty_dir: trunk/include/libhfp/Makefile.am
    W: -empty_dir: trunk/libhfp/events.cpp
    W: -empty_dir: trunk/m4/acx_pthread.m4
    W: -empty_dir: trunk/qt/hfstandalone.cpp
    W: -empty_dir: trunk/test/pumpunit.cpp
    Last fetched revision of refs/heads/master was r88, but we are about to fetch: r1!
    


DEBUG Total Mirrors failed: 1
DEBUG Done
Processing spec file /tmp/tmpkps341rf
Getting: delta/nohands
Getting delta/nohands
.. updating existing clone
Mirror of delta/nohands failed, state before mirror is saved at /srv/lorry-working-area/delta_nohands/git-a and state after mirror is saved at /srv/lorry-working-area/delta_nohands/git-post-fail
Done

495 delta/navit 3 h in 49 min 56 s 0
496 delta/enlightenment/enlightenment 3 h in 50 min 29 s 0
497 delta/linux-firmware 3 h in 50 min 36 s 0
498 delta/openstack/oslo-context 3 h in 51 min 38 s 0
499 delta/samba 3 h in 53 min 7 s 0
500 delta/openstack/ceilometer 3 h in 54 min 3 s 0
501 delta/openstack/glance_store 3 h in 54 min 6 s 0
502 delta/openstack/keystonemiddleware 3 h in 54 min 7 s 0
503 delta/openstack/oslo-incubator 3 h in 54 min 52 s 0
504 delta/openstack/oslo-middleware 3 h in 54 min 54 s 0
505 delta/node 3 h in 55 min 5 s 0
506 delta/openstack/designate 3 h in 55 min 31 s 0
507 delta/openstack/oslo-serialization 3 h in 55 min 33 s 0
508 delta/openstack/oslo-config 3 h in 55 min 36 s 0
509 delta/openstack/oslo-concurrency 3 h in 55 min 39 s 0
510 delta/openstack/oslo-policy 3 h in 55 min 41 s 0
511 delta/openstack/oslo-rootwrap 3 h in 55 min 44 s 0
512 delta/openstack/os-client-config 3 h in 55 min 47 s 0
513 delta/openstack/oslo-db 3 h in 55 min 48 s 0
514 delta/openstack/oslosphinx 3 h in 55 min 50 s 0
515 delta/openstack/ironic-python-agent 3 h in 55 min 51 s 0
516 delta/openstack/oslo-i18n 3 h in 55 min 52 s 0
517 delta/openstack/oslo-vmware 3 h in 55 min 55 s 0
518 delta/midori-git 3 h in 55 min 57 s 0
519 delta/openstack/oslo-messaging 3 h in 57 min 7 s 0
520 delta/ghostpdl 3 h in 57 min 11 s 0
521 delta/gdb 3 h in 57 min 19 s 0
522 delta/gnome/gnome-getting-started-docs 3 h in 57 min 22 s 0
523 delta/gnome/gnome-backgrounds 3 h in 57 min 57 s 0
524 delta/openstack/oslo-version 3 h in 59 min 0
525 delta/openstack/glance 3 h in 59 min 4 s 0
526 delta/openwrt/firewall3 3 h in 59 min 37 s 0
527 delta/openwrt/jsonpath 3 h in 59 min 38 s 0
528 delta/openwrt/luci2-ui 3 h in 59 min 39 s 0
529 delta/mutter 3 h in 59 min 45 s 0
530 delta/coreboot/coreboot 3 h in 59 min 59 s 0
531 delta/erlang 3 h in 1 h 0
532 delta/go-git 3 h in 1 h 0
533 delta/nautilus 3 h in 1 h 0
534 delta/mongo 3 h in 1 h 1 min 0
535 delta/openwrt/fstools 3 h in 1 h 2 min 0
536 delta/git 3 h in 1 h 2 min 0
537 delta/node-new 3 h in 1 h 2 min 0
538 delta/openwrt/libubox 3 h in 1 h 2 min 0
539 delta/openwrt/iwinfo 3 h in 1 h 3 min 0
540 delta/ocaml 3 h in 1 h 6 min 0
541 delta/openstack/oslo-log 3 h in 1 h 6 min 0
542 delta/openwrt/netifd 3 h in 1 h 8 min 0
543 delta/openwrt/procd 3 h in 1 h 8 min 0
544 delta/openwrt/rpcd 3 h in 1 h 8 min 0
545 delta/openwrt/ubox 3 h in 1 h 8 min 0
546 delta/openwrt/uci 3 h in 1 h 8 min 0
547 delta/openwrt/uclient 3 h in 1 h 8 min 0
548 delta/openstack/oslotest 3 h in 1 h 8 min 0
549 delta/openstack/pycadf 3 h in 1 h 8 min 0
550 delta/openstack/oslo-utils 3 h in 1 h 9 min 0
551 delta/openstack/python-ceilometerclient 3 h in 1 h 9 min 0
552 delta/openstack/python-barbicanclient 3 h in 1 h 9 min 0
553 delta/mesa 3 h in 1 h 10 min 0
554 delta/openstack/python-neutronclient 3 h in 1 h 11 min 0
555 delta/openstack/python-glanceclient 3 h in 1 h 11 min 0
556 delta/openwrt/libnl-tiny 3 h in 1 h 11 min 0
557 delta/openwrt/ubus 3 h in 1 h 11 min 0
558 delta/openwrt/uhttpd2 3 h in 1 h 11 min 0
559 delta/openwrt/ustream-ssl 3 h in 1 h 11 min 0
560 delta/ffmpeg 3 h in 1 h 12 min 0
561 delta/perl-dbi-tarball 3 h in 1 h 12 min 0
562 delta/perl-xml-parser 3 h in 1 h 12 min 0
563 delta/openstack/python-keystoneclient 3 h in 1 h 12 min 0
564 delta/openstack/python-cinderclient 3 h in 1 h 12 min 0
565 delta/openstack/python-designateclient 3 h in 1 h 12 min 0
566 delta/openstack/python-ironicclient 3 h in 1 h 12 min 0
567 delta/openstack/python-saharaclient 3 h in 1 h 12 min 0
568 delta/pciutils 3 h in 1 h 12 min 0
569 delta/perl-dbd-sqlite-tarball 3 h in 1 h 12 min 0
570 delta/openstack/python-swiftclient 3 h in 1 h 12 min 0
571 delta/openwrt/odhcpd 3 h in 1 h 12 min 0
572 delta/perl-xml-xpath 3 h in 1 h 12 min 0
573 delta/openstack/python-troveclient 3 h in 1 h 12 min 0
574 delta/openstack/stevedore 3 h in 1 h 12 min 0
575 delta/pv 3 h in 1 h 12 min 0
576 delta/openstack/swift-bench 3 h in 1 h 12 min 0
577 delta/openstack/tempest-lib 3 h in 1 h 13 min 0
578 delta/openwrt/odhcp6c 3 h in 1 h 13 min 0
579 delta/enlightenment/efl 3 h in 1 h 13 min 0
580 delta/glibc 3 h in 1 h 14 min 0
581 delta/haskell 3 h in 1 h 15 min 0
582 delta/php2 3 h in 1 h 15 min 0
583 delta/openstack/python-heatclient 3 h in 1 h 15 min 0
584 delta/openstack/taskflow 3 h in 1 h 15 min 0
585 delta/openstack/python-novaclient 3 h in 1 h 15 min 0
586 delta/openwrt/dropbear 3 h in 1 h 15 min 0
587 delta/patchelf 3 h in 1 h 16 min 0
588 delta/orc 3 h in 1 h 16 min 0
589 delta/openstack/heat 3 h in 1 h 16 min 0
590 delta/gnome/evolution 3 h in 1 h 17 min 0
591 delta/openstack/keystone 3 h in 1 h 17 min 0
592 delta/libvirt 3 h in 1 h 17 min 0
593 delta/openstack/trove-integration 3 h in 1 h 18 min 0
594 delta/pbr 3 h in 1 h 18 min 0
595 delta/openstack/trove 3 h in 1 h 18 min 0
596 delta/paramiko 3 h in 1 h 18 min 0
597 delta/openstack/turbo-hipster 3 h in 1 h 18 min 0
598 delta/psych 3 h in 1 h 18 min 0
599 delta/parted 3 h in 1 h 18 min 0
600 delta/openwrt/dnsmasq 3 h in 1 h 18 min 0
601 delta/ostree 3 h in 1 h 18 min 0
602 delta/pixman 3 h in 1 h 18 min 0
603 delta/pkg-config 3 h in 1 h 18 min 0
604 delta/openstack/python-openstackclient 3 h in 1 h 18 min 0
605 delta/openstack/tuskar-ui 3 h in 1 h 18 min 0
606 delta/patch 3 h in 1 h 18 min 0
607 delta/paxutils 3 h in 1 h 18 min 0
608 delta/polkit 3 h in 1 h 18 min 0
609 delta/pcre 3 h in 1 h 18 min 0
610 delta/pcre2 3 h in 1 h 18 min 0
611 delta/openstack/ironic 3 h in 1 h 19 min 0
612 delta/procps-ng 3 h in 1 h 20 min 0
613 delta/php-git 3 h in 1 h 22 min
1: Show log

INFO lorry version 0.0 starts
DEBUG sys.argv: ['/usr/bin/lorry', '--config=/etc/lorry-controller/lorry.conf', '--config=/etc/lc-site/lorry-controller/lorry.conf', '/tmp/tmptlr3ekt9']
DEBUG current working directory: /
DEBUG uid: 998
DEBUG effective uid: 998
DEBUG gid: 998
DEBUG effective gid: 998
DEBUG environment variables:
DEBUG environment: LANG=C.UTF-8
DEBUG environment: PATH=/usr/local/bin:/usr/bin
DEBUG environment: HOME=/srv/lorry
DEBUG environment: LOGNAME=lorry
DEBUG environment: USER=lorry
DEBUG environment: INVOCATION_ID=db0410faa1314185b8526a89a97b11f5
DEBUG environment: JOURNAL_STREAM=9:378598
DEBUG Config:
[config]
output = 
log = stderr
log-level = debug
log-max = 0
log-keep = 10
log-mode = 0600
dump-memory-profile = simple
memory-dump-interval = 300
working-area = /srv/lorry-working-area
mirror-base-url-push = /srv/lorry-depot
mirror-base-url-fetch = /srv/lorry-depot
pull-only = False
verbose = True
repack = True
command-stdout = None
command-stderr = None
bundle = never
bundle-dest = 
tarball = never
tarball-dest = 
keep-multiple-backups = False
push-option = 
bazaar-command = None
check-certificates = True


DEBUG Python version: 3.8.3 (default, Nov 10 2011, 15:00:00) 
[GCC 10.1.0]
DEBUG Processing spec file /tmp/tmptlr3ekt9
DEBUG Getting: delta/php-git
DEBUG Getting delta/php-git
DEBUG .. updating existing clone
DEBUG Running: argv=['git', '-c', 'gc.autodetach=false', 'fetch', '--prune', 'https://git.php.net/repository/php-src.git', '+refs/heads/*:refs/heads/*', '+refs/tags/*:refs/tags/*'] kwargs={'cwd': '/srv/lorry-working-area/delta_php-git/git-b', 'env': environ({'LANG': 'C.UTF-8', 'PATH': '/usr/local/bin:/usr/bin', 'HOME': '/srv/lorry', 'LOGNAME': 'lorry', 'USER': 'lorry', 'INVOCATION_ID': 'db0410faa1314185b8526a89a97b11f5', 'JOURNAL_STREAM': '9:378598'}), 'stdin': <_io.TextIOWrapper name='/dev/null' mode='r' encoding='UTF-8'>}
DEBUG run external command: [['git', '-c', 'gc.autodetach=false', 'fetch', '--prune', 'https://git.php.net/repository/php-src.git', '+refs/heads/*:refs/heads/*', '+refs/tags/*:refs/tags/*']]
DEBUG Command: ['git', '-c', 'gc.autodetach=false', 'fetch', '--prune', 'https://git.php.net/repository/php-src.git', '+refs/heads/*:refs/heads/*', '+refs/tags/*:refs/tags/*']
Exit: 128
Stdout:
Stderr:
    fatal: unable to access 'https://git.php.net/repository/php-src.git/': Failed to connect to git.php.net port 443: Connection timed out

DEBUG Mirror of delta/php-git failed, state before mirror is saved at /srv/lorry-working-area/delta_php-git/git-a and state after mirror is saved at /srv/lorry-working-area/delta_php-git/git-post-fail

Error mirroring:
Traceback (most recent call last):
  File "/usr/bin/lorry", line 262, in process_args
    self.gitify(name, specs[name])
  File "/usr/bin/lorry", line 375, in gitify
    table[vcstype](name, dirname, temp_repo, spec)
  File "/usr/bin/lorry", line 543, in mirror_git
    self.run_program(argv, cwd=gitdir, env=env)
  File "/usr/bin/lorry", line 868, in run_program
    raise Exception('%s failed (exit code %s):\n%s' %
Exception: git -c gc.autodetach=false fetch --prune https://git.php.net/repository/php-src.git +refs/heads/*:refs/heads/* +refs/tags/*:refs/tags/* failed (exit code 128):
    fatal: unable to access 'https://git.php.net/repository/php-src.git/': Failed to connect to git.php.net port 443: Connection timed out

ERROR Traceback (most recent call last):
  File "/usr/bin/lorry", line 262, in process_args
    self.gitify(name, specs[name])
  File "/usr/bin/lorry", line 375, in gitify
    table[vcstype](name, dirname, temp_repo, spec)
  File "/usr/bin/lorry", line 543, in mirror_git
    self.run_program(argv, cwd=gitdir, env=env)
  File "/usr/bin/lorry", line 868, in run_program
    raise Exception('%s failed (exit code %s):\n%s' %
Exception: git -c gc.autodetach=false fetch --prune https://git.php.net/repository/php-src.git +refs/heads/*:refs/heads/* +refs/tags/*:refs/tags/* failed (exit code 128):
    fatal: unable to access 'https://git.php.net/repository/php-src.git/': Failed to connect to git.php.net port 443: Connection timed out


DEBUG Total Mirrors failed: 1
DEBUG Done
Processing spec file /tmp/tmptlr3ekt9
Getting: delta/php-git
Getting delta/php-git
.. updating existing clone
Mirror of delta/php-git failed, state before mirror is saved at /srv/lorry-working-area/delta_php-git/git-a and state after mirror is saved at /srv/lorry-working-area/delta_php-git/git-post-fail
Done

614 delta/opus 3 h in 1 h 22 min 0
615 delta/openstack/swift 3 h in 1 h 23 min 0
616 delta/openstack/tempest 3 h in 1 h 23 min 0
617 delta/pip 3 h in 1 h 23 min 0
618 delta/openstack/zuul 3 h in 1 h 23 min 0
619 delta/libwebp 3 h in 1 h 25 min 0
620 delta/ppp 3 h in 1 h 25 min 0
621 delta/cpython-git 3 h in 1 h 26 min 0
622 delta/rust 3 h in 1 h 32 min 0
623 delta/python-packages/beautifulsoup4 3 h in 1 h 34 min
1: Show log

INFO lorry version 0.0 starts
DEBUG sys.argv: ['/usr/bin/lorry', '--config=/etc/lorry-controller/lorry.conf', '--config=/etc/lc-site/lorry-controller/lorry.conf', '/tmp/tmp3p3i0f6y']
DEBUG current working directory: /
DEBUG uid: 998
DEBUG effective uid: 998
DEBUG gid: 998
DEBUG effective gid: 998
DEBUG environment variables:
DEBUG environment: LANG=C.UTF-8
DEBUG environment: PATH=/usr/local/bin:/usr/bin
DEBUG environment: HOME=/srv/lorry
DEBUG environment: LOGNAME=lorry
DEBUG environment: USER=lorry
DEBUG environment: INVOCATION_ID=db0410faa1314185b8526a89a97b11f5
DEBUG environment: JOURNAL_STREAM=9:378598
DEBUG Config:
[config]
output = 
log = stderr
log-level = debug
log-max = 0
log-keep = 10
log-mode = 0600
dump-memory-profile = simple
memory-dump-interval = 300
working-area = /srv/lorry-working-area
mirror-base-url-push = /srv/lorry-depot
mirror-base-url-fetch = /srv/lorry-depot
pull-only = False
verbose = True
repack = True
command-stdout = None
command-stderr = None
bundle = never
bundle-dest = 
tarball = never
tarball-dest = 
keep-multiple-backups = False
push-option = 
bazaar-command = None
check-certificates = True


DEBUG Python version: 3.8.3 (default, Nov 10 2011, 15:00:00) 
[GCC 10.1.0]
DEBUG Processing spec file /tmp/tmp3p3i0f6y
DEBUG Getting: delta/python-packages/beautifulsoup4
DEBUG Getting delta/python-packages/beautifulsoup4
DEBUG Mirror of delta/python-packages/beautifulsoup4 failed, state before mirror is saved at /srv/lorry-working-area/delta_python-packages_beautifulsoup4/git-a and state after mirror is saved at /srv/lorry-working-area/delta_python-packages_beautifulsoup4/git-post-fail

Error mirroring:
Traceback (most recent call last):
  File "/usr/bin/lorry", line 262, in process_args
    self.gitify(name, specs[name])
  File "/usr/bin/lorry", line 375, in gitify
    table[vcstype](name, dirname, temp_repo, spec)
  File "/usr/bin/lorry", line 547, in gitify_bzr
    if os.path.basename(bzr) == 'brz':
  File "/usr/lib/python3.8/posixpath.py", line 142, in basename
    p = os.fspath(p)
TypeError: expected str, bytes or os.PathLike object, not NoneType
ERROR Traceback (most recent call last):
  File "/usr/bin/lorry", line 262, in process_args
    self.gitify(name, specs[name])
  File "/usr/bin/lorry", line 375, in gitify
    table[vcstype](name, dirname, temp_repo, spec)
  File "/usr/bin/lorry", line 547, in gitify_bzr
    if os.path.basename(bzr) == 'brz':
  File "/usr/lib/python3.8/posixpath.py", line 142, in basename
    p = os.fspath(p)
TypeError: expected str, bytes or os.PathLike object, not NoneType

DEBUG Total Mirrors failed: 1
DEBUG Done
Processing spec file /tmp/tmp3p3i0f6y
Getting: delta/python-packages/beautifulsoup4
Getting delta/python-packages/beautifulsoup4
Mirror of delta/python-packages/beautifulsoup4 failed, state before mirror is saved at /srv/lorry-working-area/delta_python-packages_beautifulsoup4/git-a and state after mirror is saved at /srv/lorry-working-area/delta_python-packages_beautifulsoup4/git-post-fail
Done

624 delta/pycurl 3 h in 1 h 34 min 0
625 delta/pyfilesystem-git 3 h in 1 h 34 min 0
626 delta/pyinotify 3 h in 1 h 34 min 0
627 delta/pyiso8601 3 h in 1 h 34 min
1: Show log

INFO lorry version 0.0 starts
DEBUG sys.argv: ['/usr/bin/lorry', '--config=/etc/lorry-controller/lorry.conf', '--config=/etc/lc-site/lorry-controller/lorry.conf', '/tmp/tmp3f8h0nwl']
DEBUG current working directory: /
DEBUG uid: 998
DEBUG effective uid: 998
DEBUG gid: 998
DEBUG effective gid: 998
DEBUG environment variables:
DEBUG environment: LANG=C.UTF-8
DEBUG environment: PATH=/usr/local/bin:/usr/bin
DEBUG environment: HOME=/srv/lorry
DEBUG environment: LOGNAME=lorry
DEBUG environment: USER=lorry
DEBUG environment: INVOCATION_ID=a94e6dd68c25466c9a694360b5c664ca
DEBUG environment: JOURNAL_STREAM=9:332723
DEBUG Config:
[config]
output = 
log = stderr
log-level = debug
log-max = 0
log-keep = 10
log-mode = 0600
dump-memory-profile = simple
memory-dump-interval = 300
working-area = /srv/lorry-working-area
mirror-base-url-push = /srv/lorry-depot
mirror-base-url-fetch = /srv/lorry-depot
pull-only = False
verbose = True
repack = True
command-stdout = None
command-stderr = None
bundle = never
bundle-dest = 
tarball = never
tarball-dest = 
keep-multiple-backups = False
push-option = 
bazaar-command = None
check-certificates = True


DEBUG Python version: 3.8.3 (default, Nov 10 2011, 15:00:00) 
[GCC 10.1.0]
DEBUG Processing spec file /tmp/tmp3f8h0nwl
DEBUG Getting: delta/pyiso8601
DEBUG Getting delta/pyiso8601
DEBUG .. updating hg branch
DEBUG Running: argv=['hg', 'pull', '--quiet', 'http://bitbucket.org/micktwomey/pyiso8601'] kwargs={'cwd': '/srv/lorry-working-area/delta_pyiso8601/hg', 'stdin': <_io.TextIOWrapper name='/dev/null' mode='r' encoding='UTF-8'>}
DEBUG run external command: [['hg', 'pull', '--quiet', 'http://bitbucket.org/micktwomey/pyiso8601']]
DEBUG Command: ['hg', 'pull', '--quiet', 'http://bitbucket.org/micktwomey/pyiso8601']
Exit: 255
Stdout:
Stderr:
    abort: HTTP Error 404: Not Found

DEBUG Mirror of delta/pyiso8601 failed, state before mirror is saved at /srv/lorry-working-area/delta_pyiso8601/git-a and state after mirror is saved at /srv/lorry-working-area/delta_pyiso8601/git-post-fail

Error mirroring:
Traceback (most recent call last):
  File "/usr/bin/lorry", line 262, in process_args
    self.gitify(name, specs[name])
  File "/usr/bin/lorry", line 375, in gitify
    table[vcstype](name, dirname, temp_repo, spec)
  File "/usr/bin/lorry", line 753, in gitify_hg
    self.run_program(
  File "/usr/bin/lorry", line 868, in run_program
    raise Exception('%s failed (exit code %s):\n%s' %
Exception: hg pull --quiet http://bitbucket.org/micktwomey/pyiso8601 failed (exit code 255):
    abort: HTTP Error 404: Not Found

ERROR Traceback (most recent call last):
  File "/usr/bin/lorry", line 262, in process_args
    self.gitify(name, specs[name])
  File "/usr/bin/lorry", line 375, in gitify
    table[vcstype](name, dirname, temp_repo, spec)
  File "/usr/bin/lorry", line 753, in gitify_hg
    self.run_program(
  File "/usr/bin/lorry", line 868, in run_program
    raise Exception('%s failed (exit code %s):\n%s' %
Exception: hg pull --quiet http://bitbucket.org/micktwomey/pyiso8601 failed (exit code 255):
    abort: HTTP Error 404: Not Found


DEBUG Total Mirrors failed: 1
DEBUG Done
Processing spec file /tmp/tmp3f8h0nwl
Getting: delta/pyiso8601
Getting delta/pyiso8601
.. updating hg branch
Mirror of delta/pyiso8601 failed, state before mirror is saved at /srv/lorry-working-area/delta_pyiso8601/git-a and state after mirror is saved at /srv/lorry-working-area/delta_pyiso8601/git-post-fail
Done

628 delta/python-cheetah 3 h in 1 h 34 min 0
629 delta/python-coverage-test-runner 3 h in 1 h 34 min 0
630 delta/python-glanceclient 3 h in 1 h 34 min 0
631 delta/python-json-patch 3 h in 1 h 34 min 0
632 delta/pyopenssl-git 3 h in 1 h 35 min 0
633 delta/python-json-pointer 3 h in 1 h 35 min 0
634 delta/python-packages/aioeventlet 3 h in 1 h 36 min
1: Show log

INFO lorry version 0.0 starts
DEBUG sys.argv: ['/usr/bin/lorry', '--config=/etc/lorry-controller/lorry.conf', '--config=/etc/lc-site/lorry-controller/lorry.conf', '/tmp/tmpl7xiv04c']
DEBUG current working directory: /
DEBUG uid: 998
DEBUG effective uid: 998
DEBUG gid: 998
DEBUG effective gid: 998
DEBUG environment variables:
DEBUG environment: LANG=C.UTF-8
DEBUG environment: PATH=/usr/local/bin:/usr/bin
DEBUG environment: HOME=/srv/lorry
DEBUG environment: LOGNAME=lorry
DEBUG environment: USER=lorry
DEBUG environment: INVOCATION_ID=3213f572a01648f39e23ca04a92b6da3
DEBUG environment: JOURNAL_STREAM=9:332716
DEBUG Config:
[config]
output = 
log = stderr
log-level = debug
log-max = 0
log-keep = 10
log-mode = 0600
dump-memory-profile = simple
memory-dump-interval = 300
working-area = /srv/lorry-working-area
mirror-base-url-push = /srv/lorry-depot
mirror-base-url-fetch = /srv/lorry-depot
pull-only = False
verbose = True
repack = True
command-stdout = None
command-stderr = None
bundle = never
bundle-dest = 
tarball = never
tarball-dest = 
keep-multiple-backups = False
push-option = 
bazaar-command = None
check-certificates = True


DEBUG Python version: 3.8.3 (default, Nov 10 2011, 15:00:00) 
[GCC 10.1.0]
DEBUG Processing spec file /tmp/tmpl7xiv04c
DEBUG Getting: delta/python-packages/aioeventlet
DEBUG Getting delta/python-packages/aioeventlet
DEBUG .. updating hg branch
DEBUG Running: argv=['hg', 'pull', '--quiet', 'http://bitbucket.org/haypo/aioeventlet'] kwargs={'cwd': '/srv/lorry-working-area/delta_python-packages_aioeventlet/hg', 'stdin': <_io.TextIOWrapper name='/dev/null' mode='r' encoding='UTF-8'>}
DEBUG run external command: [['hg', 'pull', '--quiet', 'http://bitbucket.org/haypo/aioeventlet']]
DEBUG Command: ['hg', 'pull', '--quiet', 'http://bitbucket.org/haypo/aioeventlet']
Exit: 255
Stdout:
Stderr:
    abort: HTTP Error 404: Not Found

DEBUG Mirror of delta/python-packages/aioeventlet failed, state before mirror is saved at /srv/lorry-working-area/delta_python-packages_aioeventlet/git-a and state after mirror is saved at /srv/lorry-working-area/delta_python-packages_aioeventlet/git-post-fail

Error mirroring:
Traceback (most recent call last):
  File "/usr/bin/lorry", line 262, in process_args
    self.gitify(name, specs[name])
  File "/usr/bin/lorry", line 375, in gitify
    table[vcstype](name, dirname, temp_repo, spec)
  File "/usr/bin/lorry", line 753, in gitify_hg
    self.run_program(
  File "/usr/bin/lorry", line 868, in run_program
    raise Exception('%s failed (exit code %s):\n%s' %
Exception: hg pull --quiet http://bitbucket.org/haypo/aioeventlet failed (exit code 255):
    abort: HTTP Error 404: Not Found

ERROR Traceback (most recent call last):
  File "/usr/bin/lorry", line 262, in process_args
    self.gitify(name, specs[name])
  File "/usr/bin/lorry", line 375, in gitify
    table[vcstype](name, dirname, temp_repo, spec)
  File "/usr/bin/lorry", line 753, in gitify_hg
    self.run_program(
  File "/usr/bin/lorry", line 868, in run_program
    raise Exception('%s failed (exit code %s):\n%s' %
Exception: hg pull --quiet http://bitbucket.org/haypo/aioeventlet failed (exit code 255):
    abort: HTTP Error 404: Not Found


DEBUG Total Mirrors failed: 1
DEBUG Done
Processing spec file /tmp/tmpl7xiv04c
Getting: delta/python-packages/aioeventlet
Getting delta/python-packages/aioeventlet
.. updating hg branch
Mirror of delta/python-packages/aioeventlet failed, state before mirror is saved at /srv/lorry-working-area/delta_python-packages_aioeventlet/git-a and state after mirror is saved at /srv/lorry-working-area/delta_python-packages_aioeventlet/git-post-fail
Done

635 delta/python-packages/alembic 3 h in 1 h 36 min 0
636 delta/python-keystoneclient 3 h in 1 h 36 min 0
637 delta/python-markdown 3 h in 1 h 36 min 0
638 delta/pygtk 3 h in 1 h 36 min 0
639 delta/py2cairo 3 h in 1 h 37 min 0
640 delta/python-packages/appdirs 3 h in 1 h 37 min 0
641 delta/python-packages/ansicolor 3 h in 1 h 37 min 0
642 delta/python-packages/apscheduler 3 h in 1 h 37 min 0
643 delta/openstack/cinder 3 h in 1 h 37 min 0
644 delta/python-packages/enum34 3 h in 1 h 37 min 0
645 delta/python-packages/blessings 3 h in 1 h 37 min 0
646 delta/python-packages/blinker 3 h in 1 h 37 min 0
647 delta/python-packages/cliff 3 h in 1 h 37 min 0
648 delta/python-packages/configshell-fb 3 h in 1 h 37 min 0
649 delta/python-packages/cliff-tablib 3 h in 1 h 37 min 0
650 delta/python-packages/creole 3 h in 1 h 37 min 0
651 delta/python-packages/defusedxml-git 3 h in 1 h 37 min 0
652 delta/python-packages/click 3 h in 1 h 37 min 0
653 delta/pygobject 3 h in 1 h 37 min 0
654 delta/python-packages/croniter 3 h in 1 h 37 min 0
655 delta/pango 3 h in 1 h 37 min 0
656 delta/python-packages/ordereddict-tarball 3 h in 1 h 39 min 0
657 delta/python-packages/dateutil-git 3 h in 1 h 39 min 0
658 delta/python-packages/django-compressor 3 h in 1 h 39 min 0
659 delta/python-packages/django-appconf 3 h in 1 h 39 min 0
660 delta/python-packages/django-pyscss 3 h in 1 h 39 min 0
661 delta/python-packages/dnspython 3 h in 1 h 39 min 0
662 delta/python-coveragepy-git 3 h in 1 h 39 min
1: Show log

INFO lorry version 0.0 starts
DEBUG sys.argv: ['/usr/bin/lorry', '--config=/etc/lorry-controller/lorry.conf', '--config=/etc/lc-site/lorry-controller/lorry.conf', '/tmp/tmpyi79x1fo']
DEBUG current working directory: /
DEBUG uid: 998
DEBUG effective uid: 998
DEBUG gid: 998
DEBUG effective gid: 998
DEBUG environment variables:
DEBUG environment: LANG=C.UTF-8
DEBUG environment: PATH=/usr/local/bin:/usr/bin
DEBUG environment: HOME=/srv/lorry
DEBUG environment: LOGNAME=lorry
DEBUG environment: USER=lorry
DEBUG environment: INVOCATION_ID=db0410faa1314185b8526a89a97b11f5
DEBUG environment: JOURNAL_STREAM=9:378598
DEBUG Config:
[config]
output = 
log = stderr
log-level = debug
log-max = 0
log-keep = 10
log-mode = 0600
dump-memory-profile = simple
memory-dump-interval = 300
working-area = /srv/lorry-working-area
mirror-base-url-push = /srv/lorry-depot
mirror-base-url-fetch = /srv/lorry-depot
pull-only = False
verbose = True
repack = True
command-stdout = None
command-stderr = None
bundle = never
bundle-dest = 
tarball = never
tarball-dest = 
keep-multiple-backups = False
push-option = 
bazaar-command = None
check-certificates = True


DEBUG Python version: 3.8.3 (default, Nov 10 2011, 15:00:00) 
[GCC 10.1.0]
DEBUG Processing spec file /tmp/tmpyi79x1fo
DEBUG Getting: delta/python-coveragepy-git
DEBUG Getting delta/python-coveragepy-git
DEBUG .. updating existing clone
DEBUG Running: argv=['git', '-c', 'gc.autodetach=false', 'fetch', '--prune', 'https://github.com/nedbat/coveragepy.git', '+refs/heads/*:refs/heads/*', '+refs/tags/*:refs/tags/*'] kwargs={'cwd': '/srv/lorry-working-area/delta_python-coveragepy-git/git-b', 'env': environ({'LANG': 'C.UTF-8', 'PATH': '/usr/local/bin:/usr/bin', 'HOME': '/srv/lorry', 'LOGNAME': 'lorry', 'USER': 'lorry', 'INVOCATION_ID': 'db0410faa1314185b8526a89a97b11f5', 'JOURNAL_STREAM': '9:378598'}), 'stdin': <_io.TextIOWrapper name='/dev/null' mode='r' encoding='UTF-8'>}
DEBUG run external command: [['git', '-c', 'gc.autodetach=false', 'fetch', '--prune', 'https://github.com/nedbat/coveragepy.git', '+refs/heads/*:refs/heads/*', '+refs/tags/*:refs/tags/*']]
DEBUG Command: ['git', '-c', 'gc.autodetach=false', 'fetch', '--prune', 'https://github.com/nedbat/coveragepy.git', '+refs/heads/*:refs/heads/*', '+refs/tags/*:refs/tags/*']
Exit: 0
Stdout:
Stderr:

DEBUG .. repacking delta/python-coveragepy-git git repository
DEBUG Running: argv=['git', 'config', 'pack.windowMemory', '128M'] kwargs={'cwd': '/srv/lorry-working-area/delta_python-coveragepy-git/git-b', 'stdin': <_io.TextIOWrapper name='/dev/null' mode='r' encoding='UTF-8'>}
DEBUG run external command: [['git', 'config', 'pack.windowMemory', '128M']]
DEBUG Command: ['git', 'config', 'pack.windowMemory', '128M']
Exit: 0
Stdout:
Stderr:

DEBUG Running: argv=['git', 'gc'] kwargs={'cwd': '/srv/lorry-working-area/delta_python-coveragepy-git/git-b', 'stdin': <_io.TextIOWrapper name='/dev/null' mode='r' encoding='UTF-8'>}
DEBUG run external command: [['git', 'gc']]
DEBUG Command: ['git', 'gc']
Exit: 0
Stdout:
Stderr:

DEBUG .. pushing delta/python-coveragepy-git to mirror server /srv/lorry-depot/delta/python-coveragepy-git.git
DEBUG Running: argv=['git', 'push', '/srv/lorry-depot/delta/python-coveragepy-git.git', '+refs/heads/*', '+refs/tags/*'] kwargs={'cwd': '/srv/lorry-working-area/delta_python-coveragepy-git/git-b', 'stdin': <_io.TextIOWrapper name='/dev/null' mode='r' encoding='UTF-8'>}
DEBUG run external command: [['git', 'push', '/srv/lorry-depot/delta/python-coveragepy-git.git', '+refs/heads/*', '+refs/tags/*']]
DEBUG Command: ['git', 'push', '/srv/lorry-depot/delta/python-coveragepy-git.git', '+refs/heads/*', '+refs/tags/*']
Exit: 1
Stdout:
Stderr:
    remote: error: cannot lock ref 'refs/heads/nedbat/pr/1114': 'refs/heads/nedbat/pr' exists; cannot create 'refs/heads/nedbat/pr/1114'        
    To /srv/lorry-depot/delta/python-coveragepy-git.git
     ! [remote rejected]   nedbat/pr/1114 -> nedbat/pr/1114 (failed to update ref)
    error: failed to push some refs to '/srv/lorry-depot/delta/python-coveragepy-git.git'

Error mirroring:
Traceback (most recent call last):
  File "/usr/bin/lorry", line 262, in process_args
    self.gitify(name, specs[name])
  File "/usr/bin/lorry", line 406, in gitify
    self.push_to_mirror_server(name, active_repo, spec['refspecs'])
  File "/usr/bin/lorry", line 844, in push_to_mirror_server
    self.run_program(['git', 'push']
  File "/usr/bin/lorry", line 868, in run_program
    raise Exception('%s failed (exit code %s):\n%s' %
Exception: git push /srv/lorry-depot/delta/python-coveragepy-git.git +refs/heads/* +refs/tags/* failed (exit code 1):
    remote: error: cannot lock ref 'refs/heads/nedbat/pr/1114': 'refs/heads/nedbat/pr' exists; cannot create 'refs/heads/nedbat/pr/1114'        
    To /srv/lorry-depot/delta/python-coveragepy-git.git
     ! [remote rejected]   nedbat/pr/1114 -> nedbat/pr/1114 (failed to update ref)
    error: failed to push some refs to '/srv/lorry-depot/delta/python-coveragepy-git.git'

ERROR Traceback (most recent call last):
  File "/usr/bin/lorry", line 262, in process_args
    self.gitify(name, specs[name])
  File "/usr/bin/lorry", line 406, in gitify
    self.push_to_mirror_server(name, active_repo, spec['refspecs'])
  File "/usr/bin/lorry", line 844, in push_to_mirror_server
    self.run_program(['git', 'push']
  File "/usr/bin/lorry", line 868, in run_program
    raise Exception('%s failed (exit code %s):\n%s' %
Exception: git push /srv/lorry-depot/delta/python-coveragepy-git.git +refs/heads/* +refs/tags/* failed (exit code 1):
    remote: error: cannot lock ref 'refs/heads/nedbat/pr/1114': 'refs/heads/nedbat/pr' exists; cannot create 'refs/heads/nedbat/pr/1114'        
    To /srv/lorry-depot/delta/python-coveragepy-git.git
     ! [remote rejected]   nedbat/pr/1114 -> nedbat/pr/1114 (failed to update ref)
    error: failed to push some refs to '/srv/lorry-depot/delta/python-coveragepy-git.git'


DEBUG Total Mirrors failed: 1
DEBUG Done
Processing spec file /tmp/tmpyi79x1fo
Getting: delta/python-coveragepy-git
Getting delta/python-coveragepy-git
.. updating existing clone
.. repacking delta/python-coveragepy-git git repository
.. pushing delta/python-coveragepy-git to mirror server /srv/lorry-depot/delta/python-coveragepy-git.git
Done

663 delta/python-novaclient 3 h in 1 h 39 min 0
664 delta/python-packages/dogpile-cache 3 h in 1 h 39 min 0
665 delta/python-packages/ecdsa 3 h in 1 h 39 min 0
666 delta/pulseaudio 3 h in 1 h 40 min 0
667 delta/python-packages/dogpile-core 3 h in 1 h 40 min 0
668 delta/python-packages/fixtures-git 3 h in 1 h 40 min 0
669 delta/python-packages/feedgenerator 3 h in 1 h 40 min 0
670 delta/python-packages/fusepy 3 h in 1 h 40 min 0
671 delta/python-packages/gitdb 3 h in 1 h 40 min 0
672 delta/python-packages/cmd2-git 3 h in 1 h 40 min 0
673 delta/python-packages/httplib2 3 h in 1 h 40 min 0
674 delta/python-packages/gitpython 3 h in 1 h 40 min 0
675 delta/openvswitch 3 h in 1 h 40 min 0
676 delta/openssl-new 3 h in 1 h 40 min 0
677 delta/openssh-git 3 h in 1 h 41 min 0
678 delta/llvm 3 h in 1 h 43 min 0
679 delta/python-packages/ipaddr-py 3 h in 1 h 43 min 0
680 delta/python-packages/greenlet 3 h in 1 h 43 min 0
681 delta/python-packages/cffi 3 h in 1 h 43 min 0
682 delta/python-packages/happybase 3 h in 1 h 43 min 0
683 delta/python-packages/gear 3 h in 1 h 43 min 0
684 delta/python-packages/httpretty 3 h in 1 h 43 min 0
685 delta/python-packages/iniherit 3 h in 1 h 43 min 0
686 delta/python-packages/posix-ipc-tarball 3 h in 1 h 43 min 0
687 delta/python-packages/isodate 3 h in 1 h 43 min 0
688 delta/python-packages/itsdangerous 3 h in 1 h 43 min 0
689 delta/python-packages/jsonpath-rw 3 h in 1 h 43 min 0
690 delta/python-packages/kazoo 3 h in 1 h 43 min 0
691 delta/python-packages/mocker 3 h in 1 h 43 min 0
692 delta/python-packages/jsonrpclib 3 h in 1 h 43 min 0
693 delta/python-packages/librabbitmq 3 h in 1 h 43 min 0
694 delta/python-lxml 3 h in 1 h 43 min 0
695 delta/python-packages/astroid-git 3 h in 1 h 43 min 0
696 delta/python-packages/eventlet 3 h in 1 h 43 min 0
697 delta/python-packages/mod_wsgi-metrics 3 h in 1 h 43 min 0
698 delta/python-packages/gitlab 3 h in 1 h 43 min 0
699 delta/python-packages/kafka-python 3 h in 1 h 43 min 0
700 delta/python-packages/logutils-git 3 h in 1 h 43 min 0
701 delta/python-packages/mako 3 h in 1 h 43 min 0
702 delta/python-packages/mysqldb1 3 h in 1 h 43 min 0
703 delta/python-packages/netifaces-git 3 h in 1 h 43 min 0
704 delta/python-packages/lockfile 3 h in 1 h 43 min 0
705 delta/p11-kit 3 h in 1 h 43 min 0
706 delta/python-packages/flake8 3 h in 1 h 43 min 0
707 delta/emacs 3 h in 1 h 44 min 0
708 delta/python-packages/mod_wsgi 3 h in 1 h 45 min 0
709 delta/python-packages/msgpack-python 3 h in 1 h 45 min 0
710 delta/python-packages/nose 3 h in 1 h 45 min 0
711 delta/python-packages/osprofiler 3 h in 1 h 45 min 0
712 delta/ceph 3 h in 1 h 45 min 0
713 delta/python-packages/paste-git 3 h in 1 h 49 min 0
714 delta/python-packages/pies 3 h in 1 h 49 min 0
715 delta/python-packages/kombu 3 h in 1 h 49 min 0
716 delta/python-packages/natsort 3 h in 1 h 49 min 0
717 delta/python-packages/py-bcrypt-git 3 h in 1 h 49 min 0
718 delta/python-packages/python-decorator 3 h in 1 h 49 min 0
719 delta/python-packages/pep8 3 h in 1 h 49 min 0
720 delta/python-packages/pluginbase 3 h in 1 h 49 min 0
721 delta/python-packages/pastedeploy-git 3 h in 1 h 49 min 0
722 delta/python-packages/python-rfc3986 3 h in 1 h 49 min 0
723 delta/python-packages/m2crypto 3 h in 1 h 49 min 0
724 delta/python-packages/pecan 3 h in 1 h 49 min 0
725 delta/python-packages/oauthlib 3 h in 1 h 49 min 0
726 delta/python-packages/pexpect 3 h in 1 h 49 min 0
727 delta/python-packages/openid 3 h in 1 h 49 min 0
728 delta/python-packages/py-amqp 3 h in 1 h 49 min 0
729 delta/python-packages/pyasn1-git 3 h in 1 h 49 min 0
730 delta/gtk+ 3 h in 1 h 54 min
1: Show log

INFO lorry version 0.0 starts
DEBUG sys.argv: ['/usr/bin/lorry', '--config=/etc/lorry-controller/lorry.conf', '--config=/etc/lc-site/lorry-controller/lorry.conf', '/tmp/tmp7mbjrti2']
DEBUG current working directory: /
DEBUG uid: 998
DEBUG effective uid: 998
DEBUG gid: 998
DEBUG effective gid: 998
DEBUG environment variables:
DEBUG environment: LANG=C.UTF-8
DEBUG environment: PATH=/usr/local/bin:/usr/bin
DEBUG environment: HOME=/srv/lorry
DEBUG environment: LOGNAME=lorry
DEBUG environment: USER=lorry
DEBUG environment: INVOCATION_ID=6ca9258c0ee54d619461ecdd18947ab5
DEBUG environment: JOURNAL_STREAM=9:378599
DEBUG Config:
[config]
output = 
log = stderr
log-level = debug
log-max = 0
log-keep = 10
log-mode = 0600
dump-memory-profile = simple
memory-dump-interval = 300
working-area = /srv/lorry-working-area
mirror-base-url-push = /srv/lorry-depot
mirror-base-url-fetch = /srv/lorry-depot
pull-only = False
verbose = True
repack = True
command-stdout = None
command-stderr = None
bundle = never
bundle-dest = 
tarball = never
tarball-dest = 
keep-multiple-backups = False
push-option = 
bazaar-command = None
check-certificates = True


DEBUG Python version: 3.8.3 (default, Nov 10 2011, 15:00:00) 
[GCC 10.1.0]
DEBUG Processing spec file /tmp/tmp7mbjrti2
DEBUG Getting: delta/gtk+
DEBUG Getting delta/gtk+
DEBUG .. updating existing clone
DEBUG Running: argv=['git', '-c', 'gc.autodetach=false', 'fetch', '--prune', 'https://gitlab.gnome.org/GNOME/gtk.git', '+refs/heads/*:refs/heads/*', '+refs/tags/*:refs/tags/*'] kwargs={'cwd': '/srv/lorry-working-area/delta_gtk+/git-a', 'env': environ({'LANG': 'C.UTF-8', 'PATH': '/usr/local/bin:/usr/bin', 'HOME': '/srv/lorry', 'LOGNAME': 'lorry', 'USER': 'lorry', 'INVOCATION_ID': '6ca9258c0ee54d619461ecdd18947ab5', 'JOURNAL_STREAM': '9:378599'}), 'stdin': <_io.TextIOWrapper name='/dev/null' mode='r' encoding='UTF-8'>}
DEBUG run external command: [['git', '-c', 'gc.autodetach=false', 'fetch', '--prune', 'https://gitlab.gnome.org/GNOME/gtk.git', '+refs/heads/*:refs/heads/*', '+refs/tags/*:refs/tags/*']]
DEBUG Command: ['git', '-c', 'gc.autodetach=false', 'fetch', '--prune', 'https://gitlab.gnome.org/GNOME/gtk.git', '+refs/heads/*:refs/heads/*', '+refs/tags/*:refs/tags/*']
Exit: 0
Stdout:
Stderr:

DEBUG .. repacking delta/gtk+ git repository
DEBUG Running: argv=['git', 'config', 'pack.windowMemory', '128M'] kwargs={'cwd': '/srv/lorry-working-area/delta_gtk+/git-a', 'stdin': <_io.TextIOWrapper name='/dev/null' mode='r' encoding='UTF-8'>}
DEBUG run external command: [['git', 'config', 'pack.windowMemory', '128M']]
DEBUG Command: ['git', 'config', 'pack.windowMemory', '128M']
Exit: 0
Stdout:
Stderr:

DEBUG Running: argv=['git', 'gc'] kwargs={'cwd': '/srv/lorry-working-area/delta_gtk+/git-a', 'stdin': <_io.TextIOWrapper name='/dev/null' mode='r' encoding='UTF-8'>}
DEBUG run external command: [['git', 'gc']]
DEBUG Command: ['git', 'gc']
Exit: 0
Stdout:
Stderr:

DEBUG .. pushing delta/gtk+ to mirror server /srv/lorry-depot/delta/gtk+.git
DEBUG Running: argv=['git', 'push', '/srv/lorry-depot/delta/gtk+.git', 'refs/tags/*', '+refs/heads/*'] kwargs={'cwd': '/srv/lorry-working-area/delta_gtk+/git-a', 'stdin': <_io.TextIOWrapper name='/dev/null' mode='r' encoding='UTF-8'>}
DEBUG run external command: [['git', 'push', '/srv/lorry-depot/delta/gtk+.git', 'refs/tags/*', '+refs/heads/*']]
DEBUG Command: ['git', 'push', '/srv/lorry-depot/delta/gtk+.git', 'refs/tags/*', '+refs/heads/*']
Exit: 1
Stdout:
Stderr:
    remote: error: cannot lock ref 'refs/heads/a11y/atspi-child': 'refs/heads/a11y' exists; cannot create 'refs/heads/a11y/atspi-child'        
    remote: error: cannot lock ref 'refs/heads/a11y/buildable': 'refs/heads/a11y' exists; cannot create 'refs/heads/a11y/buildable'        
    remote: error: cannot lock ref 'refs/heads/a11y/label-name': 'refs/heads/a11y' exists; cannot create 'refs/heads/a11y/label-name'        
    remote: error: cannot lock ref 'refs/heads/a11y/stackswitcher-tabs': 'refs/heads/a11y' exists; cannot create 'refs/heads/a11y/stackswitcher-tabs'        
    To /srv/lorry-depot/delta/gtk+.git
     ! [remote rejected]       a11y/atspi-child -> a11y/atspi-child (failed to update ref)
     ! [remote rejected]       a11y/buildable -> a11y/buildable (failed to update ref)
     ! [remote rejected]       a11y/label-name -> a11y/label-name (failed to update ref)
     ! [remote rejected]       a11y/stackswitcher-tabs -> a11y/stackswitcher-tabs (failed to update ref)
    error: failed to push some refs to '/srv/lorry-depot/delta/gtk+.git'

Error mirroring:
Traceback (most recent call last):
  File "/usr/bin/lorry", line 262, in process_args
    self.gitify(name, specs[name])
  File "/usr/bin/lorry", line 406, in gitify
    self.push_to_mirror_server(name, active_repo, spec['refspecs'])
  File "/usr/bin/lorry", line 844, in push_to_mirror_server
    self.run_program(['git', 'push']
  File "/usr/bin/lorry", line 868, in run_program
    raise Exception('%s failed (exit code %s):\n%s' %
Exception: git push /srv/lorry-depot/delta/gtk+.git refs/tags/* +refs/heads/* failed (exit code 1):
    remote: error: cannot lock ref 'refs/heads/a11y/atspi-child': 'refs/heads/a11y' exists; cannot create 'refs/heads/a11y/atspi-child'        
    remote: error: cannot lock ref 'refs/heads/a11y/buildable': 'refs/heads/a11y' exists; cannot create 'refs/heads/a11y/buildable'        
    remote: error: cannot lock ref 'refs/heads/a11y/label-name': 'refs/heads/a11y' exists; cannot create 'refs/heads/a11y/label-name'        
    remote: error: cannot lock ref 'refs/heads/a11y/stackswitcher-tabs': 'refs/heads/a11y' exists; cannot create 'refs/heads/a11y/stackswitcher-tabs'        
    To /srv/lorry-depot/delta/gtk+.git
     ! [remote rejected]       a11y/atspi-child -> a11y/atspi-child (failed to update ref)
     ! [remote rejected]       a11y/buildable -> a11y/buildable (failed to update ref)
     ! [remote rejected]       a11y/label-name -> a11y/label-name (failed to update ref)
     ! [remote rejected]       a11y/stackswitcher-tabs -> a11y/stackswitcher-tabs (failed to update ref)
    error: failed to push some refs to '/srv/lorry-depot/delta/gtk+.git'

ERROR Traceback (most recent call last):
  File "/usr/bin/lorry", line 262, in process_args
    self.gitify(name, specs[name])
  File "/usr/bin/lorry", line 406, in gitify
    self.push_to_mirror_server(name, active_repo, spec['refspecs'])
  File "/usr/bin/lorry", line 844, in push_to_mirror_server
    self.run_program(['git', 'push']
  File "/usr/bin/lorry", line 868, in run_program
    raise Exception('%s failed (exit code %s):\n%s' %
Exception: git push /srv/lorry-depot/delta/gtk+.git refs/tags/* +refs/heads/* failed (exit code 1):
    remote: error: cannot lock ref 'refs/heads/a11y/atspi-child': 'refs/heads/a11y' exists; cannot create 'refs/heads/a11y/atspi-child'        
    remote: error: cannot lock ref 'refs/heads/a11y/buildable': 'refs/heads/a11y' exists; cannot create 'refs/heads/a11y/buildable'        
    remote: error: cannot lock ref 'refs/heads/a11y/label-name': 'refs/heads/a11y' exists; cannot create 'refs/heads/a11y/label-name'        
    remote: error: cannot lock ref 'refs/heads/a11y/stackswitcher-tabs': 'refs/heads/a11y' exists; cannot create 'refs/heads/a11y/stackswitcher-tabs'        
    To /srv/lorry-depot/delta/gtk+.git
     ! [remote rejected]       a11y/atspi-child -> a11y/atspi-child (failed to update ref)
     ! [remote rejected]       a11y/buildable -> a11y/buildable (failed to update ref)
     ! [remote rejected]       a11y/label-name -> a11y/label-name (failed to update ref)
     ! [remote rejected]       a11y/stackswitcher-tabs -> a11y/stackswitcher-tabs (failed to update ref)
    error: failed to push some refs to '/srv/lorry-depot/delta/gtk+.git'


DEBUG Total Mirrors failed: 1
DEBUG Done
Processing spec file /tmp/tmp7mbjrti2
Getting: delta/gtk+
Getting delta/gtk+
.. updating existing clone
.. repacking delta/gtk+ git repository
.. pushing delta/gtk+ to mirror server /srv/lorry-depot/delta/gtk+.git
Done

731 delta/libpopt 3 h in 1 h 54 min
1: Show log

INFO lorry version 0.0 starts
DEBUG sys.argv: ['/usr/bin/lorry', '--config=/etc/lorry-controller/lorry.conf', '--config=/etc/lc-site/lorry-controller/lorry.conf', '/tmp/tmpt_75hgqj']
DEBUG current working directory: /
DEBUG uid: 998
DEBUG effective uid: 998
DEBUG gid: 998
DEBUG effective gid: 998
DEBUG environment variables:
DEBUG environment: LANG=C.UTF-8
DEBUG environment: PATH=/usr/local/bin:/usr/bin
DEBUG environment: HOME=/srv/lorry
DEBUG environment: LOGNAME=lorry
DEBUG environment: USER=lorry
DEBUG environment: INVOCATION_ID=3213f572a01648f39e23ca04a92b6da3
DEBUG environment: JOURNAL_STREAM=9:332716
DEBUG Config:
[config]
output = 
log = stderr
log-level = debug
log-max = 0
log-keep = 10
log-mode = 0600
dump-memory-profile = simple
memory-dump-interval = 300
working-area = /srv/lorry-working-area
mirror-base-url-push = /srv/lorry-depot
mirror-base-url-fetch = /srv/lorry-depot
pull-only = False
verbose = True
repack = True
command-stdout = None
command-stderr = None
bundle = never
bundle-dest = 
tarball = never
tarball-dest = 
keep-multiple-backups = False
push-option = 
bazaar-command = None
check-certificates = True


DEBUG Python version: 3.8.3 (default, Nov 10 2011, 15:00:00) 
[GCC 10.1.0]
DEBUG Processing spec file /tmp/tmpt_75hgqj
DEBUG Getting: delta/libpopt
DEBUG Getting delta/libpopt
DEBUG Running: argv=['git', 'worktree', 'prune'] kwargs={'cwd': '/srv/lorry-working-area/delta_libpopt/git-b', 'stdin': <_io.TextIOWrapper name='/dev/null' mode='r' encoding='UTF-8'>}
DEBUG run external command: [['git', 'worktree', 'prune']]
DEBUG Command: ['git', 'worktree', 'prune']
Exit: 0
Stdout:
Stderr:

DEBUG Running: argv=['git', 'worktree', 'add', '/srv/lorry-working-area/delta_libpopt/git-cvs-worktree', 'master'] kwargs={'cwd': '/srv/lorry-working-area/delta_libpopt/git-b', 'stdin': <_io.TextIOWrapper name='/dev/null' mode='r' encoding='UTF-8'>}
DEBUG run external command: [['git', 'worktree', 'add', '/srv/lorry-working-area/delta_libpopt/git-cvs-worktree', 'master']]
DEBUG Command: ['git', 'worktree', 'add', '/srv/lorry-working-area/delta_libpopt/git-cvs-worktree', 'master']
Exit: 0
Stdout:
    Preparing worktree (checking out 'master')
    HEAD is now at 85302cd - fix: handle glob(3) error returns (bz#1051685).
Stderr:

DEBUG run external command: [['git', 'rev-parse', '--git-dir']]
DEBUG Running: argv=['git', 'cvsimport', '-a', '-d', ':pserver:anonymous@rpm5.org:/cvs', '-C', '/srv/lorry-working-area/delta_libpopt/git-cvs-worktree', 'popt'] kwargs={'env': {'LANG': 'C.UTF-8', 'PATH': '/usr/local/bin:/usr/bin', 'HOME': '/srv/lorry-working-area/delta_libpopt/git-b', 'LOGNAME': 'lorry', 'USER': 'lorry', 'INVOCATION_ID': '3213f572a01648f39e23ca04a92b6da3', 'JOURNAL_STREAM': '9:332716', 'CVS_RSH': 'lorry-ssh-wrapper', 'GIT_DIR': '/srv/lorry-working-area/delta_libpopt/git-b/worktrees/git-cvs-worktree'}, 'stdin': <_io.TextIOWrapper name='/dev/null' mode='r' encoding='UTF-8'>}
DEBUG run external command: [['git', 'cvsimport', '-a', '-d', ':pserver:anonymous@rpm5.org:/cvs', '-C', '/srv/lorry-working-area/delta_libpopt/git-cvs-worktree', 'popt']]
DEBUG Command: ['git', 'cvsimport', '-a', '-d', ':pserver:anonymous@rpm5.org:/cvs', '-C', '/srv/lorry-working-area/delta_libpopt/git-cvs-worktree', 'popt']
Exit: 110
Stdout:
Stderr:
    Socket to rpm5.org: Connection timed out

DEBUG Mirror of delta/libpopt failed, state before mirror is saved at /srv/lorry-working-area/delta_libpopt/git-a and state after mirror is saved at /srv/lorry-working-area/delta_libpopt/git-post-fail

Error mirroring:
Traceback (most recent call last):
  File "/usr/bin/lorry", line 262, in process_args
    self.gitify(name, specs[name])
  File "/usr/bin/lorry", line 375, in gitify
    table[vcstype](name, dirname, temp_repo, spec)
  File "/usr/bin/lorry", line 715, in gitify_cvs
    self.run_program(
  File "/usr/bin/lorry", line 868, in run_program
    raise Exception('%s failed (exit code %s):\n%s' %
Exception: git cvsimport -a -d :pserver:anonymous@rpm5.org:/cvs -C /srv/lorry-working-area/delta_libpopt/git-cvs-worktree popt failed (exit code 110):
    Socket to rpm5.org: Connection timed out

ERROR Traceback (most recent call last):
  File "/usr/bin/lorry", line 262, in process_args
    self.gitify(name, specs[name])
  File "/usr/bin/lorry", line 375, in gitify
    table[vcstype](name, dirname, temp_repo, spec)
  File "/usr/bin/lorry", line 715, in gitify_cvs
    self.run_program(
  File "/usr/bin/lorry", line 868, in run_program
    raise Exception('%s failed (exit code %s):\n%s' %
Exception: git cvsimport -a -d :pserver:anonymous@rpm5.org:/cvs -C /srv/lorry-working-area/delta_libpopt/git-cvs-worktree popt failed (exit code 110):
    Socket to rpm5.org: Connection timed out


DEBUG Total Mirrors failed: 1
DEBUG Done
Processing spec file /tmp/tmpt_75hgqj
Getting: delta/libpopt
Getting delta/libpopt
Mirror of delta/libpopt failed, state before mirror is saved at /srv/lorry-working-area/delta_libpopt/git-a and state after mirror is saved at /srv/lorry-working-area/delta_libpopt/git-post-fail
Done

732 delta/python-packages/isort 3 h in 1 h 55 min 0
733 delta/python-fastimport-git 3 h in 1 h 55 min 0
734 delta/python-packages/ply 3 h in 1 h 56 min 0
735 delta/python-packages/pint 3 h in 1 h 56 min 0
736 delta/python-packages/python-daemon 3 h in 1 h 56 min 0
737 delta/python-packages/pycadf 3 h in 1 h 57 min 0
738 delta/python-packages/psycopg2 3 h in 1 h 57 min 0
739 delta/python-packages/pycco 3 h in 1 h 57 min 0
740 delta/python-packages/pycrypto 3 h in 1 h 57 min 0
741 delta/python-packages/pyflakes 3 h in 1 h 57 min 0
742 delta/python-packages/pygerrit 3 h in 1 h 59 min 0
743 delta/python-packages/pylru 3 h in 1 h 59 min 0
744 delta/python-packages/pyjwt 3 h in 1 h 59 min 0
745 delta/python-packages/pymemcache 3 h in 1 h 59 min 0
746 delta/mariadb-git 3 h in 1 h 59 min 0
747 delta/python-packages/pymox 3 h in 2 h 1 min 0
748 delta/python-packages/simplegeneric-tarball 3 h in 2 h 1 min 0
749 delta/python-packages/pycparser 3 h in 2 h 1 min 0
750 delta/python-packages/pysendfile 3 h in 2 h 1 min 0
751 delta/python-packages/sysv-ipc-tarball 3 h in 2 h 1 min 0
752 delta/python-packages/pyparsing-git 3 h in 2 h 1 min 0
753 delta/python-packages/pyscss 3 h in 2 h 1 min 0
754 delta/python-packages/pyopenssl 3 h in 2 h 1 min 0
755 delta/python-packages/pyserial-git 3 h in 2 h 1 min 0
756 delta/gitlab/gitlab-ce 3 h in 2 h 1 min 0
757 delta/python-packages/pystache 3 h in 2 h 1 min 0
758 delta/python-packages/pystatsd 3 h in 2 h 1 min 0
759 delta/python-packages/pysnmp-git 3 h in 2 h 1 min 0
760 delta/python-packages/python-decorator-git 3 h in 2 h 1 min 0
761 delta/python-packages/python-mimeparse 3 h in 2 h 1 min 0
762 delta/python-packages/pytest-runner 3 h in 2 h 1 min 0
763 delta/python-packages/python-memcached 3 h in 2 h 1 min 0
764 delta/python-packages/python-requests-aws 3 h in 2 h 1 min 0
765 delta/python-packages/python-slugify 3 h in 2 h 1 min 0
766 delta/python-packages/pysaml2 3 h in 2 h 1 min 0
767 delta/python-packages/python-systemd 3 h in 2 h 1 min 0
768 delta/python-packages/python-magic 3 h in 2 h 1 min 0
769 delta/python-packages/python-test-extras 3 h in 2 h 1 min 0
770 delta/python-packages/rabbitmq-c-github-ask 3 h in 2 h 1 min 0
771 delta/python-packages/repoze-lru 3 h in 2 h 1 min 0
772 delta/python-packages/rabbitmq-c 3 h in 2 h 1 min 0
773 delta/python-packages/redis-py 3 h in 2 h 1 min 0
774 delta/python-packages/networkx 3 h in 2 h 1 min 0
775 delta/python-packages/retrying 3 h in 2 h 1 min 0
776 delta/python-packages/psutil 3 h in 2 h 1 min 0
777 delta/python-packages/pygments-git 3 h in 2 h 1 min 0
778 delta/python-packages/routes 3 h in 2 h 1 min 0
779 delta/python-packages/requests-cache 3 h in 2 h 3 min 0
780 delta/python-packages/rq 3 h in 2 h 3 min 0
781 delta/python-packages/rtslib-fb 3 h in 2 h 3 min 0
782 delta/python-packages/smartypants-git 3 h in 2 h 3 min 0
783 delta/python-packages/semantic-version 3 h in 2 h 3 min 0
784 delta/python-packages/smmap 3 h in 2 h 3 min 0
785 delta/python-packages/snowballstemmer 3 h in 2 h 3 min 0
786 delta/python-packages/setuptools-scm 3 h in 2 h 3 min 0
787 delta/python-packages/sqlalchemy-migrate 3 h in 2 h 3 min 0
788 delta/python-packages/targetcli 3 h in 2 h 3 min 0
789 delta/python-packages/subunit-git 3 h in 2 h 3 min 0
790 delta/python-packages/testrepository-git 3 h in 2 h 3 min 0
791 delta/python-packages/testresources-git 3 h in 2 h 3 min 0
792 delta/python-packages/raven 3 h in 2 h 3 min 0
793 delta/python-packages/rsa-git 3 h in 2 h 3 min 0
794 delta/python-packages/sqlparse 3 h in 2 h 3 min 0
795 delta/python-packages/cryptography 3 h in 2 h 3 min 0
796 delta/python-packages/tablib 3 h in 2 h 3 min 0
797 delta/python-packages/testscenarios-git 3 h in 2 h 3 min 0
798 delta/python-packages/times 3 h in 2 h 3 min 0
799 delta/openstack/neutron 3 h in 2 h 4 min 0
800 delta/python-packages/unidecode 3 h in 2 h 5 min 0
801 delta/python-packages/trollius-git 3 h in 2 h 5 min 0
802 delta/python-packages/testtools 3 h in 2 h 5 min 0
803 delta/python-packages/waitress 3 h in 2 h 5 min 0
804 delta/python-packages/urwid 3 h in 2 h 7 min 0
805 delta/python-packages/urllib3 3 h in 2 h 7 min 0
806 delta/python-packages/voluptuous 3 h in 2 h 7 min 0
807 delta/python-packages/websocket-client 3 h in 2 h 7 min 0
808 delta/python-packages/webtest 3 h in 2 h 7 min 0
809 delta/python-packages/wsgiref 3 h in 2 h 7 min 0
810 delta/python-packages/websockify 3 h in 2 h 7 min 0
811 delta/python-packages/wheel-git 3 h in 2 h 7 min 0
812 delta/python-packages/wsme 3 h in 2 h 7 min 0
813 delta/python-packages/xattr 3 h in 2 h 7 min 0
814 delta/python-packages/zake 3 h in 2 h 7 min 0
815 delta/python-packages/zope-browser 3 h in 2 h 7 min 0
816 delta/python-packages/webob 3 h in 2 h 7 min 0
817 delta/python-packages/pyeclib 3 h in 2 h 7 min 0
818 delta/python-packages/zope-configuration 3 h in 2 h 7 min 0
819 delta/python-packages/zope-contenttype 3 h in 2 h 7 min 0
820 delta/python-packages/zope-event 3 h in 2 h 7 min 0
821 delta/python-packages/zope-exceptions 3 h in 2 h 7 min 0
822 delta/pytz-tarball 3 h in 2 h 7 min 0
823 delta/python-packages/rdflib 3 h in 2 h 7 min 0
824 delta/python-packages/zope-component 3 h in 2 h 8 min 0
825 delta/python-packages/zope-location 3 h in 2 h 8 min 0
826 delta/python-packages/zope-i18nmessageid 3 h in 2 h 8 min 0
827 delta/python-packages/zope-pagetemplate 3 h in 2 h 8 min 0
828 delta/python-packages/zope-proxy 3 h in 2 h 8 min 0
829 delta/sdl 3 h in 2 h 9 min 0
830 delta/python-packages/zope-publisher 3 h in 2 h 10 min 0
831 delta/python-packages/tox-git 3 h in 2 h 10 min 0
832 delta/python-packages/zope-schema 3 h in 2 h 10 min 0
833 delta/ragel-tarball 3 h in 2 h 11 min 0
834 delta/rarian 3 h in 2 h 11 min 0
835 delta/python-packages/zope-security 3 h in 2 h 11 min 0
836 delta/python-packages/zope-tales 3 h in 2 h 11 min 0
837 delta/python-packages/zope-i18n 3 h in 2 h 11 min 0
838 delta/python-packages/zope-traversing 3 h in 2 h 11 min 0
839 delta/python-packages/zope-interface 3 h in 2 h 11 min 0
840 delta/python-prettytable-ptable 3 h in 2 h 11 min 0
841 delta/python-packages/zope-tal 3 h in 2 h 11 min 0
842 delta/qemu-palcode 3 h in 2 h 11 min 0
843 delta/pycairo 3 h in 2 h 11 min 0
844 delta/python-requests 3 h in 2 h 11 min 0
845 delta/python-ttystatus 3 h in 2 h 11 min 0
846 delta/python/pelican 3 h in 2 h 11 min 0
847 delta/pyyaml-git 3 h in 2 h 11 min 0
848 delta/pyzy 3 h in 2 h 12 min 0
849 delta/qemu-SLOF 3 h in 2 h 12 min 0
850 delta/qemu-openbios 3 h in 2 h 12 min 0
851 delta/qemu-sgabios 3 h in 2 h 12 min 0
852 delta/qemu-vgabios 3 h in 2 h 12 min 0
853 delta/qemu-openhackware 3 h in 2 h 12 min 0
854 delta/qt5/qtapplicationmanager 3 h in 2 h 12 min 0
855 delta/qt5/qtenginio 3 h in 2 h 12 min 0
856 delta/qt5/qtivi-qface 3 h in 2 h 12 min 0
857 delta/qt5/qtivi 3 h in 2 h 12 min 0
858 delta/qemu-seabios 3 h in 2 h 12 min 0
859 delta/qt5/neptune-ui 3 h in 2 h 12 min 0
860 delta/qt5/qtrepotools 3 h in 2 h 12 min 0
861 delta/qt5/qtjsbackend 3 h in 2 h 12 min 0
862 delta/qt5/qtwebkit-examples 3 h in 2 h 12 min 0
863 delta/python-packages/werkzeug 3 h in 2 h 12 min 0
864 delta/qt5/qtactiveqt 3 h in 2 h 12 min 0
865 delta/binutils-gdb 3 h in 2 h 13 min 0
866 delta/qt5 3 h in 2 h 13 min 0
867 delta/qt5/qtqa 3 h in 2 h 13 min 0
868 delta/qt5/qtimageformats 3 h in 2 h 13 min 0
869 delta/python-packages/tooz 3 h in 2 h 14 min 0
870 delta/qt5/qtquick1 3 h in 2 h 14 min 0
871 delta/qt5/qtquickcontrols 3 h in 2 h 14 min 0
872 delta/qt5/qtscript 3 h in 2 h 14 min 0
873 delta/qt5/qtsensors 3 h in 2 h 14 min 0
874 delta/qt5/qtwebchannel 3 h in 2 h 14 min 0
875 delta/qt5/qtserialport 3 h in 2 h 14 min 0
876 delta/qt5/qtwebsockets 3 h in 2 h 14 min 0
877 delta/qt5/qtsvg 3 h in 2 h 14 min 0
878 delta/qt5/qtx11extras 3 h in 2 h 14 min 0
879 delta/qt5/qtxmlpatterns 3 h in 2 h 14 min 0
880 delta/qt5/qtxmlpatterns-testsuites 3 h in 2 h 14 min 0
881 delta/sbc 3 h in 2 h 14 min 0
882 delta/qt5/qtconnectivity 3 h in 2 h 15 min 0
883 delta/qt5/qttranslations 3 h in 2 h 15 min 0
884 delta/speex 3 h in 2 h 15 min 0
885 delta/qt5/qtwayland 3 h in 2 h 15 min 0
886 delta/python-packages/uwsgi 3 h in 2 h 15 min 0
887 delta/rpcbind 3 h in 2 h 15 min 0
888 delta/VirtualBox-svn 3 h in 2 h 15 min 0
889 delta/ruby-gems/erubis 3 h in 2 h 15 min 0
890 delta/ruby-gems/ffi-yajl 3 h in 2 h 15 min 0
891 delta/nspr-hg 3 h in 2 h 15 min 0
892 delta/qbs 3 h in 2 h 15 min 0
893 delta/rabbitmq-codegen-git 3 h in 2 h 15 min 0
894 delta/qt5/qtgraphicaleffects 3 h in 2 h 15 min 0
895 delta/ruby-gems/chef-zero 3 h in 2 h 15 min 0
896 delta/qemu-ipxe 3 h in 2 h 15 min 0
897 delta/qt5/qtlocation 3 h in 2 h 15 min 0
898 delta/ruby-gems/diff-lcs 3 h in 2 h 15 min 0
899 delta/ruby-gems/ffi 3 h in 2 h 15 min 0
900 delta/ruby-gems/hashie 3 h in 2 h 15 min 0
901 delta/rsync 3 h in 2 h 15 min 0
902 delta/ruby-gems/highline 3 h in 2 h 15 min 0
903 delta/ruby-gems/hoe 3 h in 2 h 15 min 0
904 delta/python-packages/pylint-git 3 h in 2 h 15 min 0
905 delta/python-packages/rdiff-backup 3 h in 2 h 15 min 0
906 delta/ruby-gems/ipaddress 3 h in 2 h 17 min 0
907 delta/ruby-gems/json 3 h in 2 h 17 min 0
908 delta/ruby-gems/mime-types 3 h in 2 h 17 min 0
909 delta/ruby-gems/libyajl2-gem 3 h in 2 h 17 min 0
910 delta/ruby-gems/mixlib-log 3 h in 2 h 17 min 0
911 delta/ruby-gems/coderay 3 h in 2 h 17 min 0
912 delta/ruby-gems/mixlib-authentication 3 h in 2 h 17 min 0
913 delta/ruby-gems/mixlib-cli 3 h in 2 h 17 min 0
914 delta/ruby-gems/mixlib-config 3 h in 2 h 17 min 0
915 delta/ruby-gems/net-ssh-gateway 3 h in 2 h 17 min 0
916 delta/ruby-gems/mixlib-shellout 3 h in 2 h 17 min 0
917 delta/ruby-gems/plist 3 h in 2 h 17 min 0
918 delta/sed-tarball 3 h in 2 h 17 min 0
919 delta/ruby-gems/net-ssh-multi 3 h in 2 h 17 min 0
920 delta/ruby-gems/rake-compiler 3 h in 2 h 17 min 0
921 delta/ruby-gems/systemu 3 h in 2 h 17 min 0
922 delta/snowshoe 3 h in 2 h 17 min 0
923 delta/tar-tarball 3 h in 2 h 17 min 0
924 delta/tcp-wrappers 3 h in 2 h 17 min 0
925 delta/ruby-gems/slop 3 h in 2 h 17 min 0
926 delta/ruby-gems/wmi-lite 3 h in 2 h 17 min 0
927 delta/sqlite3 3 h in 2 h 17 min 0
928 delta/rust-installer 3 h in 2 h 17 min 0
929 delta/sandboxlib 3 h in 2 h 17 min 0
930 delta/ttf-alee 3 h in 2 h 17 min 0
931 delta/ruby-gems/rack 3 h in 2 h 17 min 0
932 delta/ragel 3 h in 2 h 17 min 0
933 delta/rust-hoedown 3 h in 2 h 17 min 0
934 delta/scipy-sphinx-theme 3 h in 2 h 17 min 0
935 delta/six-git 3 h in 2 h 17 min 0
936 delta/python-packages/ruamel.base 3 h in 2 h 17 min 0
937 delta/qt5/qtmultimedia 3 h in 2 h 17 min 0
938 delta/ATCD 3 h in 2 h 18 min 0
939 delta/ruby-gems/method_source 3 h in 2 h 18 min 0
940 delta/rvi/rvi_sota_client 3 h in 2 h 18 min 0
941 delta/python-packages/ruamel.std.argparse 3 h in 2 h 18 min 0
942 delta/snappy-git 3 h in 2 h 18 min 0
943 delta/subversion-tarball 3 h in 2 h 18 min 0
944 delta/texinfo-tarball 3 h in 2 h 18 min 0
945 delta/tftp-hpa 3 h in 2 h 18 min 0
946 delta/ruby-gems/net-ssh 3 h in 2 h 18 min 0
947 delta/sigc++ 3 h in 2 h 20 min 0
948 delta/sgdisk 3 h in 2 h 20 min 0
949 delta/simplejson 3 h in 2 h 20 min 0
950 delta/sound-theme-freedesktop 3 h in 2 h 20 min 0
951 delta/startup-notification 3 h in 2 h 20 min 0
952 delta/suckless/dwm 3 h in 2 h 20 min 0
953 delta/suckless/slock 3 h in 2 h 20 min 0
954 delta/ruby-gems/pry 3 h in 2 h 20 min 0
955 delta/raptor 3 h in 2 h 20 min 0
956 delta/readline 3 h in 2 h 21 min 0
957 delta/tftpy 3 h in 2 h 21 min 0
958 delta/telepathy-haze 3 h in 2 h 21 min 0
959 delta/unionfs-fuse-git 3 h in 2 h 21 min 0
960 delta/telepathy-idle 3 h in 2 h 21 min 0
961 delta/ti-rpc 3 h in 2 h 21 min 0
962 delta/ruby-gems/ohai 3 h in 2 h 21 min 0
963 delta/xmlto-tarball 3 h in 2 h 21 min 0
964 delta/screen 3 h in 2 h 21 min 0
965 delta/suckless/dmenu 3 h in 2 h 21 min 0
966 delta/sed 3 h in 2 h 21 min 0
967 delta/sloccount-git 3 h in 2 h 21 min 0
968 delta/telepathy-logger 3 h in 2 h 21 min 0
969 delta/stow 3 h in 2 h 21 min 0
970 delta/urlgrabber 3 h in 2 h 21 min 0
971 delta/syslinux 3 h in 2 h 21 min 0
972 delta/telepathy-farstream 3 h in 2 h 21 min 0
973 delta/uriparser 3 h in 2 h 21 min 0
974 delta/usbutils 3 h in 2 h 21 min 0
975 delta/warlock 3 h in 2 h 21 min 0
976 delta/python-setuptools-git 3 h in 2 h 21 min 0
977 delta/xfce/garcon 3 h in 2 h 21 min 0
978 delta/qt5/qtwebengine 3 h in 2 h 21 min 0
979 delta/dropbear 3 h in 2 h 21 min 0
980 delta/telepathy-salut 3 h in 2 h 21 min 0
981 delta/rvi/rvi_core 3 h in 2 h 21 min 0
982 delta/python-packages/virtualenv 3 h in 2 h 21 min 0
983 delta/rygel 3 h in 2 h 21 min 0
984 delta/qt5/qtdoc 3 h in 2 h 21 min 0
985 delta/tz 3 h in 2 h 21 min 0
986 delta/tar 3 h in 2 h 22 min 0
987 delta/util-image 3 h in 2 h 22 min 0
988 delta/util-keysyms 3 h in 2 h 23 min 0
989 delta/usbhid-dump 3 h in 2 h 23 min 0
990 delta/xfce/thunar-desktop-plugin 3 h in 2 h 23 min 0
991 delta/scons-git 3 h in 2 h 23 min 0
992 delta/shadow 3 h in 2 h 23 min 0
993 delta/upower 3 h in 2 h 23 min 0
994 delta/qt5/qttools 3 h in 2 h 23 min 0
995 delta/shared-mime-info 3 h in 2 h 23 min 0
996 delta/tremor 3 h in 2 h 24 min 0
997 delta/telepathy-mission-control 3 h in 2 h 24 min 0
998 delta/python-packages/sphinx-git 3 h in 2 h 24 min 0
999 delta/util-keysysm/m4 3 h in 2 h 24 min 0
1000 delta/xfce/gtk-xfce-engine 3 h in 2 h 25 min 0
1001 delta/util-wm 3 h in 2 h 25 min 0
1002 delta/xfce/libxfce4util 3 h in 2 h 25 min 0
1003 delta/wayland-protocols 3 h in 2 h 25 min 0
1004 delta/xfce/thunar-volman 3 h in 2 h 25 min 0
1005 delta/web-socket-js 3 h in 2 h 26 min 0
1006 delta/webrtc-audio-processing 3 h in 2 h 26 min 0
1007 delta/xfce/libxfce4ui 3 h in 2 h 26 min 0
1008 delta/xcb-libxcb 3 h in 2 h 26 min 0
1009 delta/xfce/tumbler 3 h in 2 h 26 min 0
1010 delta/xfce/xfce4-dev-tools 3 h in 2 h 26 min 0
1011 delta/xfce/xfce4-docs 3 h in 2 h 26 min 0
1012 delta/gcc 3 h in 2 h 27 min 0
1013 delta/tcpdump 3 h in 2 h 27 min 0
1014 delta/xcb-proto 3 h in 2 h 27 min 0
1015 delta/redis 3 h in 2 h 28 min 0
1016 delta/xcb/util-common-m4 3 h in 2 h 28 min 0
1017 delta/pytz-git 3 h in 2 h 28 min 0
1018 delta/xcb-util 3 h in 2 h 28 min 0
1019 delta/xcb-pthread-stubs 3 h in 2 h 28 min 0
1020 delta/xfce/exo 3 h in 2 h 28 min 0
1021 delta/xfce/xfce4-appfinder 3 h in 2 h 28 min 0
1022 delta/xfce/ixfce4-power-manager 3 h in 2 h 28 min 0
1023 delta/xfce/xfconf 3 h in 2 h 28 min 0
1024 delta/wayland 3 h in 2 h 28 min 0
1025 delta/xfce/xfce4-session 3 h in 2 h 28 min 0
1026 delta/xfce/xfce4-settings 3 h in 2 h 28 min 0
1027 delta/python-packages/docutils 3 h in 2 h 29 min 0
1028 delta/xorg-app-xauth 3 h in 2 h 30 min 0
1029 delta/xorg-app-xinit 3 h in 2 h 30 min 0
1030 delta/xorg-app-xkbcomp 3 h in 2 h 30 min 0
1031 delta/xorg-driver-xf86-input-keyboard 3 h in 2 h 30 min 0
1032 delta/xorg-driver-xf86-input-libinput 3 h in 2 h 31 min 0
1033 delta/xfce/xfdesktop 3 h in 2 h 31 min 0
1034 delta/xorg-driver-xf86-input-evdev 3 h in 2 h 31 min 0
1035 delta/xorg-driver-xf86-input-mouse 3 h in 2 h 31 min 0
1036 delta/xorg-driver-xf86-video-cirrus 3 h in 2 h 31 min 0
1037 delta/weston 3 h in 2 h 31 min 0
1038 delta/xkeyboard-config 3 h in 2 h 31 min 0
1039 delta/xorg-driver-xf86-video-fbdev 3 h in 2 h 31 min 0
1040 delta/telepathy-gabble 3 h in 2 h 31 min 0
1041 delta/xfce/xfce4-panel 3 h in 2 h 31 min 0
1042 delta/xorg-driver-xf86-video-nouveau 3 h in 2 h 31 min 0
1043 delta/wget 3 h in 2 h 35 min 0
1044 delta/thrift 3 h in 2 h 35 min 0
1045 delta/smartdevicelink/sdl_ios 3 h in 2 h 35 min 0
1046 delta/strace 3 h in 2 h 35 min 0
1047 delta/xorg-driver-xf86-video-vesa 3 h in 2 h 36 min 0
1048 delta/xorg-font-util 3 h in 2 h 36 min 0
1049 delta/xorg-lib-libICE 3 h in 2 h 36 min 0
1050 delta/xorg-lib-libSM 3 h in 2 h 36 min 0
1051 delta/xorg-lib-libXRes 3 h in 2 h 36 min 0
1052 delta/xorg-lib-libXScrnSaver 3 h in 2 h 36 min 0
1053 delta/xorg-lib-libXau 3 h in 2 h 36 min 0
1054 delta/xorg-lib-libXaw 3 h in 2 h 36 min 0
1055 delta/xorg-lib-libXcomposite 3 h in 2 h 36 min 0
1056 delta/xorg-lib-libXcursor 3 h in 2 h 36 min 0
1057 delta/xorg-lib-libXdamage 3 h in 2 h 36 min 0
1058 delta/openstack/horizon 3 h in 2 h 37 min 0
1059 delta/xorg-lib-libXfixes 3 h in 2 h 38 min 0
1060 delta/xorg-lib-libXext 3 h in 2 h 38 min 0
1061 delta/xorg-lib-libXft 3 h in 2 h 38 min 0
1062 delta/xorg-lib-libXinerama 3 h in 2 h 38 min 0
1063 delta/xorg-lib-libXpm 3 h in 2 h 38 min 0
1064 delta/xorg-lib-libXmu 3 h in 2 h 38 min 0
1065 delta/udisks 3 h in 2 h 38 min 0
1066 delta/xorg-lib-libXfont 3 h in 2 h 38 min 0
1067 delta/xorg-lib-libXrender 3 h in 2 h 38 min 0
1068 delta/xorg-lib-libXi 3 h in 2 h 38 min 0
1069 delta/xorg-lib-libXt 3 h in 2 h 38 min 0
1070 delta/telepathy-glib 3 h in 2 h 38 min 0
1071 delta/xorg-lib-libdmx 3 h in 2 h 39 min 0
1072 delta/xorg-lib-libXtst 3 h in 2 h 39 min 0
1073 delta/xorg-lib-libX11 3 h in 2 h 39 min 0
1074 delta/virt-manager 3 h in 2 h 39 min 0
1075 delta/xterm 3 h in 2 h 40 min 0
1076 delta/zip 3 h in 2 h 40 min 0
1077 delta/xorg-lib-libXrandr 3 h in 2 h 40 min 0
1078 delta/xorg-lib-libfontenc 3 h in 2 h 40 min 0
1079 delta/xorg-lib-libXp 3 h in 2 h 40 min 0
1080 delta/xorg-lib-libpciaccess 3 h in 2 h 40 min 0
1081 delta/xorg-lib-libXv 3 h in 2 h 40 min 0
1082 delta/xorg-lib-libxkbcommon 3 h in 2 h 40 min 0
1083 delta/xorg-lib-libxkbfile 3 h in 2 h 40 min 0
1084 delta/xorg-lib-libxshmfence 3 h in 2 h 40 min 0
1085 delta/xorg-lib-libxtrans 3 h in 2 h 41 min 0
1086 delta/xorg-proto-bigreqsproto 3 h in 2 h 41 min 0
1087 delta/xorg-proto-compositeproto 3 h in 2 h 41 min 0
1088 delta/xorg-proto-damageproto 3 h in 2 h 41 min 0
1089 delta/xorg-proto-dmxproto 3 h in 2 h 41 min 0
1090 delta/xorg-proto-dri3proto 3 h in 2 h 41 min 0
1091 delta/xorg-proto-fixesproto 3 h in 2 h 41 min 0
1092 delta/XML-Parser 3 h in 2 h 42 min 0
1093 delta/XML-Simple 3 h in 2 h 42 min 0
1094 delta/xorg-proto-resourceproto 3 h in 2 h 42 min 0
1095 delta/xorg-proto-kbproto 3 h in 2 h 42 min 0
1096 delta/xorg-proto-fontsproto 3 h in 2 h 42 min 0
1097 delta/xorg-proto-presentproto 3 h in 2 h 42 min 0
1098 delta/xorg-proto-printproto 3 h in 2 h 42 min 0
1099 delta/xorg-proto-dri2proto 3 h in 2 h 42 min 0
1100 delta/xstatic-git 3 h in 2 h 42 min 0
1101 delta/xfce/xfwm4 3 h in 2 h 43 min 0
1102 delta/rpm 3 h in 2 h 43 min 0
1103 delta/python-packages/sqlalchemy 3 h in 2 h 43 min 0
1104 delta/smartdevicelink/sdl_android 3 h in 2 h 43 min 0
1105 delta/swig 3 h in 2 h 43 min 0
1106 delta/test262 3 h in 2 h 44 min 0
1107 delta/anthy 3 h in 2 h 44 min 0
1108 delta/autoconf-tarball 3 h in 2 h 44 min 0
1109 delta/xorg-proto-glproto 3 h in 2 h 44 min 0
1110 delta/xorg-proto-randrproto 3 h in 2 h 44 min 0
1111 delta/autogen 3 h in 2 h 44 min 0
1112 delta/xorg-proto-scrnsaverproto 3 h in 2 h 44 min 0
1113 delta/xorg-proto-x11proto 3 h in 2 h 44 min 0
1114 delta/xorg-proto-inputproto 3 h in 2 h 44 min 0
1115 delta/bc-tarball 3 h in 2 h 46 min 0
1116 delta/bmake-tarball 3 h in 2 h 46 min 0
1117 delta/xorg-proto-recordproto 3 h in 2 h 46 min 0
1118 delta/bzip2 3 h in 2 h 46 min 0
1119 delta/xorg-proto-xcmiscproto 3 h in 2 h 46 min 0
1120 delta/bzr-fastimport 3 h in 2 h 46 min
1: Show log

INFO lorry version 0.0 starts
DEBUG sys.argv: ['/usr/bin/lorry', '--config=/etc/lorry-controller/lorry.conf', '--config=/etc/lc-site/lorry-controller/lorry.conf', '/tmp/tmpzxygj4qa']
DEBUG current working directory: /
DEBUG uid: 998
DEBUG effective uid: 998
DEBUG gid: 998
DEBUG effective gid: 998
DEBUG environment variables:
DEBUG environment: LANG=C.UTF-8
DEBUG environment: PATH=/usr/local/bin:/usr/bin
DEBUG environment: HOME=/srv/lorry
DEBUG environment: LOGNAME=lorry
DEBUG environment: USER=lorry
DEBUG environment: INVOCATION_ID=3213f572a01648f39e23ca04a92b6da3
DEBUG environment: JOURNAL_STREAM=9:332716
DEBUG Config:
[config]
output = 
log = stderr
log-level = debug
log-max = 0
log-keep = 10
log-mode = 0600
dump-memory-profile = simple
memory-dump-interval = 300
working-area = /srv/lorry-working-area
mirror-base-url-push = /srv/lorry-depot
mirror-base-url-fetch = /srv/lorry-depot
pull-only = False
verbose = True
repack = True
command-stdout = None
command-stderr = None
bundle = never
bundle-dest = 
tarball = never
tarball-dest = 
keep-multiple-backups = False
push-option = 
bazaar-command = None
check-certificates = True


DEBUG Python version: 3.8.3 (default, Nov 10 2011, 15:00:00) 
[GCC 10.1.0]
DEBUG Processing spec file /tmp/tmpzxygj4qa
DEBUG Getting: delta/bzr-fastimport
DEBUG Getting delta/bzr-fastimport
DEBUG Mirror of delta/bzr-fastimport failed, state before mirror is saved at /srv/lorry-working-area/delta_bzr-fastimport/git-a and state after mirror is saved at /srv/lorry-working-area/delta_bzr-fastimport/git-post-fail

Error mirroring:
Traceback (most recent call last):
  File "/usr/bin/lorry", line 262, in process_args
    self.gitify(name, specs[name])
  File "/usr/bin/lorry", line 375, in gitify
    table[vcstype](name, dirname, temp_repo, spec)
  File "/usr/bin/lorry", line 547, in gitify_bzr
    if os.path.basename(bzr) == 'brz':
  File "/usr/lib/python3.8/posixpath.py", line 142, in basename
    p = os.fspath(p)
TypeError: expected str, bytes or os.PathLike object, not NoneType
ERROR Traceback (most recent call last):
  File "/usr/bin/lorry", line 262, in process_args
    self.gitify(name, specs[name])
  File "/usr/bin/lorry", line 375, in gitify
    table[vcstype](name, dirname, temp_repo, spec)
  File "/usr/bin/lorry", line 547, in gitify_bzr
    if os.path.basename(bzr) == 'brz':
  File "/usr/lib/python3.8/posixpath.py", line 142, in basename
    p = os.fspath(p)
TypeError: expected str, bytes or os.PathLike object, not NoneType

DEBUG Total Mirrors failed: 1
DEBUG Done
Processing spec file /tmp/tmpzxygj4qa
Getting: delta/bzr-fastimport
Getting delta/bzr-fastimport
Mirror of delta/bzr-fastimport failed, state before mirror is saved at /srv/lorry-working-area/delta_bzr-fastimport/git-a and state after mirror is saved at /srv/lorry-working-area/delta_bzr-fastimport/git-post-fail
Done

1121 delta/xorg-proto-xextproto 3 h in 2 h 46 min 0
1122 delta/xorg-proto-xf86bigfontproto 3 h in 2 h 46 min 0
1123 delta/ccache-tarball 3 h in 2 h 46 min 0
1124 delta/xorg-proto-videoproto 3 h in 2 h 46 min 0
1125 delta/xorg-proto-xf86driproto 3 h in 2 h 46 min 0
1126 delta/xorg-proto-xf86dgaproto 3 h in 2 h 46 min 0
1127 delta/xorg-proto-xineramaproto 3 h in 2 h 46 min 0
1128 delta/xorg-util-makedepend 3 h in 2 h 46 min 0
1129 delta/xorg-proto-xf86vidmodeproto 3 h in 2 h 47 min 0
1130 delta/DLT-daemon 3 h in 2 h 47 min 0
1131 delta/xstatic-packages/xstatic-angular-animate 3 h in 2 h 47 min 0
1132 delta/xorg-util-macros 3 h in 2 h 47 min 0
1133 delta/xstatic-packages/xstatic-angular 3 h in 2 h 47 min 0
1134 delta/xstatic-packages/xstatic-angular-bootstrap 3 h in 2 h 47 min 0
1135 delta/xstatic-packages/xstatic-angular-lrdragndrop 3 h in 2 h 47 min 0
1136 delta/xstatic-packages/xstatic-jquery-git 3 h in 2 h 47 min 0
1137 delta/xstatic-packages/xstatic-jquery-ui-git 3 h in 2 h 47 min 0
1138 delta/check 3 h in 2 h 51 min 0
1139 delta/alsa-utils 3 h in 2 h 51 min 0
1140 delta/pidgin 3 h in 2 h 51 min
1: Show log

INFO lorry version 0.0 starts
DEBUG sys.argv: ['/usr/bin/lorry', '--config=/etc/lorry-controller/lorry.conf', '--config=/etc/lc-site/lorry-controller/lorry.conf', '/tmp/tmp8l6ibfhq']
DEBUG current working directory: /
DEBUG uid: 998
DEBUG effective uid: 998
DEBUG gid: 998
DEBUG effective gid: 998
DEBUG environment variables:
DEBUG environment: LANG=C.UTF-8
DEBUG environment: PATH=/usr/local/bin:/usr/bin
DEBUG environment: HOME=/srv/lorry
DEBUG environment: LOGNAME=lorry
DEBUG environment: USER=lorry
DEBUG environment: INVOCATION_ID=a94e6dd68c25466c9a694360b5c664ca
DEBUG environment: JOURNAL_STREAM=9:332723
DEBUG Config:
[config]
output = 
log = stderr
log-level = debug
log-max = 0
log-keep = 10
log-mode = 0600
dump-memory-profile = simple
memory-dump-interval = 300
working-area = /srv/lorry-working-area
mirror-base-url-push = /srv/lorry-depot
mirror-base-url-fetch = /srv/lorry-depot
pull-only = False
verbose = True
repack = True
command-stdout = None
command-stderr = None
bundle = never
bundle-dest = 
tarball = never
tarball-dest = 
keep-multiple-backups = False
push-option = 
bazaar-command = None
check-certificates = True


DEBUG Python version: 3.8.3 (default, Nov 10 2011, 15:00:00) 
[GCC 10.1.0]
DEBUG Processing spec file /tmp/tmp8l6ibfhq
DEBUG Getting: delta/pidgin
DEBUG Getting delta/pidgin
DEBUG .. updating hg branch
DEBUG Running: argv=['hg', 'pull', '--quiet', 'https://keep.imfreedom.org/pidgin/pidgin'] kwargs={'cwd': '/srv/lorry-working-area/delta_pidgin/hg', 'stdin': <_io.TextIOWrapper name='/dev/null' mode='r' encoding='UTF-8'>}
DEBUG run external command: [['hg', 'pull', '--quiet', 'https://keep.imfreedom.org/pidgin/pidgin']]
DEBUG Command: ['hg', 'pull', '--quiet', 'https://keep.imfreedom.org/pidgin/pidgin']
Exit: 0
Stdout:
Stderr:

DEBUG .. updating existing clone
DEBUG /srv/lorry-working-area/delta_pidgin/git-a/hg2git-marks: pruned 2851 unreachable commit(s)
DEBUG run external command: [['hg-fast-export', '--help']]
DEBUG .. fast-exporting into git
DEBUG Running: argv=['hg-fast-export', '-r', '../hg', '--quiet', '--force', '--plugin-path', '/usr/bin/../share/lorry/hg-fast-export/plugins', '--plugin', 'fudge_user_ids'] kwargs={'cwd': '/srv/lorry-working-area/delta_pidgin/git-a', 'stdin': <_io.TextIOWrapper name='/dev/null' mode='r' encoding='UTF-8'>}
DEBUG run external command: [['hg-fast-export', '-r', '../hg', '--quiet', '--force', '--plugin-path', '/usr/bin/../share/lorry/hg-fast-export/plugins', '--plugin', 'fudge_user_ids']]
DEBUG Command: ['hg-fast-export', '-r', '../hg', '--quiet', '--force', '--plugin-path', '/usr/bin/../share/lorry/hg-fast-export/plugins', '--plugin', 'fudge_user_ids']
Exit: 1
Stdout:
Stderr:
    /usr/bin/hg-fast-export: line 204:  7092 Killed                  GIT_DIR="$GIT_DIR" "$PYTHON" "$ROOT/hg-fast-export.py" --repo "$REPO" --marks "$GIT_DIR/$PFX-$SFX_MARKS" --mapping "$GIT_DIR/$PFX-$SFX_MAPPING" --heads "$GIT_DIR/$PFX-$SFX_HEADS" --status "$GIT_DIR/$PFX-$SFX_STATE" "$@" 3>&-

DEBUG Mirror of delta/pidgin failed, state before mirror is saved at /srv/lorry-working-area/delta_pidgin/git-b and state after mirror is saved at /srv/lorry-working-area/delta_pidgin/git-post-fail

Error mirroring:
Traceback (most recent call last):
  File "/usr/bin/lorry", line 262, in process_args
    self.gitify(name, specs[name])
  File "/usr/bin/lorry", line 375, in gitify
    table[vcstype](name, dirname, temp_repo, spec)
  File "/usr/bin/lorry", line 791, in gitify_hg
    self.run_program(['hg-fast-export', '-r', '../hg', '--quiet', '--force',
  File "/usr/bin/lorry", line 868, in run_program
    raise Exception('%s failed (exit code %s):\n%s' %
Exception: hg-fast-export -r ../hg --quiet --force --plugin-path /usr/bin/../share/lorry/hg-fast-export/plugins --plugin fudge_user_ids failed (exit code 1):
    /usr/bin/hg-fast-export: line 204:  7092 Killed                  GIT_DIR="$GIT_DIR" "$PYTHON" "$ROOT/hg-fast-export.py" --repo "$REPO" --marks "$GIT_DIR/$PFX-$SFX_MARKS" --mapping "$GIT_DIR/$PFX-$SFX_MAPPING" --heads "$GIT_DIR/$PFX-$SFX_HEADS" --status "$GIT_DIR/$PFX-$SFX_STATE" "$@" 3>&-

ERROR Traceback (most recent call last):
  File "/usr/bin/lorry", line 262, in process_args
    self.gitify(name, specs[name])
  File "/usr/bin/lorry", line 375, in gitify
    table[vcstype](name, dirname, temp_repo, spec)
  File "/usr/bin/lorry", line 791, in gitify_hg
    self.run_program(['hg-fast-export', '-r', '../hg', '--quiet', '--force',
  File "/usr/bin/lorry", line 868, in run_program
    raise Exception('%s failed (exit code %s):\n%s' %
Exception: hg-fast-export -r ../hg --quiet --force --plugin-path /usr/bin/../share/lorry/hg-fast-export/plugins --plugin fudge_user_ids failed (exit code 1):
    /usr/bin/hg-fast-export: line 204:  7092 Killed                  GIT_DIR="$GIT_DIR" "$PYTHON" "$ROOT/hg-fast-export.py" --repo "$REPO" --marks "$GIT_DIR/$PFX-$SFX_MARKS" --mapping "$GIT_DIR/$PFX-$SFX_MAPPING" --heads "$GIT_DIR/$PFX-$SFX_HEADS" --status "$GIT_DIR/$PFX-$SFX_STATE" "$@" 3>&-


DEBUG Total Mirrors failed: 1
DEBUG Done
Processing spec file /tmp/tmp8l6ibfhq
Getting: delta/pidgin
Getting delta/pidgin
.. updating hg branch
.. updating existing clone
/srv/lorry-working-area/delta_pidgin/git-a/hg2git-marks: pruned 2851 unreachable commit(s)
.. fast-exporting into git
Mirror of delta/pidgin failed, state before mirror is saved at /srv/lorry-working-area/delta_pidgin/git-b and state after mirror is saved at /srv/lorry-working-area/delta_pidgin/git-post-fail
Done

1141 delta/alsa-lib 3 h in 2 h 51 min 0
1142 delta/xstatic-packages/xstatic-angular-cookies 3 h in 2 h 51 min 0
1143 delta/avahi 3 h in 2 h 51 min 0
1144 delta/xorg-proto-renderproto 3 h in 2 h 51 min 0
1145 delta/xstatic-packages/xstatic-angular-fileupload 3 h in 2 h 51 min 0
1146 delta/xstatic-packages/xstatic-angular-sanitize 3 h in 2 h 51 min 0
1147 delta/xstatic-packages/xstatic-angular-smart-table 3 h in 2 h 51 min 0
1148 delta/xstatic-packages/xstatic-angular-mock 3 h in 2 h 51 min 0
1149 delta/xstatic-packages/xstatic-d3 3 h in 2 h 51 min 0
1150 delta/xstatic-packages/xstatic-jquery-tablesorter 3 h in 2 h 51 min 0
1151 delta/xstatic-packages/xstatic-bootstrap-scss 3 h in 2 h 52 min 0
1152 delta/xstatic-packages/xstatic-bootstrap-datepicker 3 h in 2 h 52 min 0
1153 delta/xstatic-packages/xstatic-font-awesome 3 h in 2 h 52 min 0
1154 delta/arping 3 h in 2 h 52 min 0
1155 delta/xstatic-packages/xstatic-qunit 3 h in 2 h 52 min 0
1156 delta/xz 3 h in 2 h 52 min 0
1157 delta/xstatic-packages/xstatic-jsencrypt 3 h in 2 h 52 min 0
1158 delta/xstatic-packages/xstatic-jquery-bootstrap-wizard 3 h in 2 h 52 min 0
1159 delta/xstatic-packages/xstatic-jquery-migrate 3 h in 2 h 52 min 0
1160 delta/xstatic-packages/xstatic-rickshaw 3 h in 2 h 52 min 0
1161 delta/yajl 3 h in 2 h 52 min 0
1162 delta/MPC 3 h in 2 h 52 min 0
1163 delta/accountsservice 3 h in 2 h 52 min 0
1164 delta/xstatic-packages/xstatic-hogan 3 h in 2 h 52 min 0
1165 delta/xorg-driver-xf86-video-intel 3 h in 2 h 52 min 0
1166 delta/xstatic-packages/xstatic-termjs 3 h in 2 h 52 min 0
1167 delta/bluez-tools 3 h in 2 h 52 min 0
1168 delta/xstatic-packages/xstatic-jquery-quicksearch 3 h in 2 h 52 min 0
1169 delta/acl 3 h in 2 h 52 min 0
1170 delta/appstream-glib 3 h in 2 h 52 min 0
1171 delta/xstatic-packages/xstatic-jasmine 3 h in 2 h 52 min 0
1172 delta/xstatic-packages/xstatic-spin 3 h in 2 h 52 min 0
1173 delta/zlib 3 h in 2 h 52 min 0
1174 delta/bzr-tarball 3 h in 2 h 53 min 0
1175 delta/bsdiff 3 h in 2 h 53 min 0
1176 delta/chinese-fonts-truetype/bkai00mp 3 h in 2 h 53 min 0
1177 delta/Open-AVB 3 h in 2 h 53 min 0
1178 delta/btrfs-progs 3 h in 2 h 53 min 0
1179 delta/chinese-fonts-truetype/bsmi00lp 3 h in 2 h 53 min 0
1180 delta/chinese-fonts-truetype/gbsn00lp 3 h in 2 h 53 min 0
1181 delta/WebKitGtk-tarball 3 h in 2 h 53 min 0
1182 delta/chinese-fonts-truetype/gkai00mp 3 h in 2 h 53 min 0
1183 delta/colm-tarball 3 h in 2 h 53 min 0
1184 delta/corkscrew 3 h in 2 h 53 min 0
1185 delta/cpan/App-cpanminus-tarball 3 h in 2 h 53 min 0
1186 delta/cpan/Archive-Extract-tarball 3 h in 2 h 53 min 0
1187 delta/cpan/CPAN-Checksums-tarball 3 h in 2 h 53 min 0
1188 delta/cpan/CPAN-DistnameInfo-tarball 3 h in 2 h 53 min 0
1189 delta/bubblewrap 3 h in 2 h 53 min 0
1190 delta/ceph-libs3 3 h in 2 h 53 min 0
1191 delta/cpan/Archive-Zip-tarball 3 h in 2 h 53 min 0
1192 delta/cpan/CGI-tarball 3 h in 2 h 53 min 0
1193 delta/cpan/CPAN-Mini-Inject-tarball 3 h in 2 h 53 min 0
1194 delta/wocky 3 h in 2 h 53 min 0
1195 delta/asciidoc-py3 3 h in 2 h 53 min 0
1196 delta/xstatic-packages/xstatic-magic-search 3 h in 2 h 53 min 0
1197 delta/yelp-tools 3 h in 2 h 53 min 0
1198 delta/yelp-xsl 3 h in 2 h 53 min 0
1199 delta/ansible-modules-extras 3 h in 2 h 54 min 0
1200 delta/carton 3 h in 2 h 54 min 0
1201 delta/colord-gtk 3 h in 2 h 54 min 0
1202 delta/yasm 3 h in 2 h 54 min 0
1203 delta/ansible-modules-core 3 h in 2 h 54 min 0
1204 delta/ybd 3 h in 2 h 55 min 0
1205 delta/ModemManager 3 h in 2 h 55 min 0
1206 delta/at-spi2-atk 3 h in 2 h 55 min 0
1207 delta/binutils-tarball 3 h in 2 h 55 min 0
1208 delta/at-spi2-core 3 h in 2 h 55 min 0
1209 delta/attr 3 h in 2 h 55 min 0
1210 delta/conntrack-tools 3 h in 2 h 55 min 0
1211 delta/cpan/CPAN-Mini-tarball 3 h in 2 h 55 min 0
1212 delta/cpan/Carton-tarball 3 h in 2 h 55 min 0
1213 delta/cpan/Class-Load-XS-tarball 3 h in 2 h 55 min 0
1214 delta/cpan/Class-Load-tarball 3 h in 2 h 55 min 0
1215 delta/cpan/Class-Tiny-tarball 3 h in 2 h 55 min 0
1216 delta/cpan/Data-Compare-tarball 3 h in 2 h 55 min 0
1217 delta/asciidoc-git 3 h in 2 h 55 min 0
1218 delta/zeitgeist 3 h in 2 h 55 min 0
1219 delta/atk 3 h in 2 h 55 min 0
1220 delta/babel 3 h in 2 h 55 min 0
1221 delta/cpan/Devel-GlobalDestruction-tarball 3 h in 2 h 55 min 0
1222 delta/apache/apr 3 h in 2 h 56 min 0
1223 delta/xfce/thunar 3 h in 2 h 56 min 0
1224 delta/cpan/Data-OptList-tarball 3 h in 2 h 57 min 0
1225 delta/bottle 3 h in 2 h 57 min 0
1226 delta/audiomanager 3 h in 2 h 57 min 0
1227 delta/ccache 3 h in 2 h 57 min 0
1228 delta/configobj-git 3 h in 2 h 57 min 0
1229 delta/boto 3 h in 2 h 57 min 0
1230 delta/zenity 3 h in 2 h 57 min 0
1231 delta/autoconf-archive 3 h in 2 h 57 min 0
1232 delta/beignet 3 h in 2 h 57 min 0
1233 delta/python-packages/numpy 3 h in 2 h 57 min 0
1234 delta/berkeleydb 3 h in 2 h 57 min 0
1235 delta/cliapp 3 h in 2 h 58 min 0
1236 delta/caribou 3 h in 2 h 58 min 0
1237 delta/linux-stable 3 h in 2 h 58 min 0
1238 delta/cmdtest 3 h in 2 h 58 min 0
1239 delta/bdwgc 3 h in 2 h 58 min 0
1240 delta/ceph-object-corpus 3 h in 2 h 58 min 0
1241 delta/autoconf 3 h in 2 h 58 min 0
1242 delta/coreutils-tarball 3 h in 2 h 58 min 0
1243 delta/cpan/Compress-Bzip2-tarball 3 h in 2 h 58 min 0
1244 delta/cpan/Devel-OverloadInfo-tarball 3 h in 2 h 58 min 0
1245 delta/cpan/Devel-StackTrace-tarball 3 h in 2 h 58 min 0
1246 delta/cpan/Dist-CheckConflicts-tarball 3 h in 2 h 58 min 0
1247 delta/cpan/Encode-Locale-tarball 3 h in 2 h 58 min 0
1248 delta/cpan/Dist-Metadata-tarball 3 h in 2 h 58 min 0
1249 delta/bash-completion 3 h in 2 h 58 min 0
1250 delta/coreboot/nvidia-cbootimage 3 h in 2 h 58 min 0
1251 delta/cpan/Eval-Closure-tarball 3 h in 2 h 58 min 0
1252 delta/cpan/Exporter-Tiny-tarball 3 h in 2 h 58 min 0
1253 delta/cpan/ExtUtils-Config-tarball 3 h in 2 h 58 min 0
1254 delta/cpan/ExtUtils-Helpers-tarball 3 h in 2 h 58 min 0
1255 delta/cpan/ExtUtils-InstallPaths-tarball 3 h in 2 h 58 min 0
1256 delta/cpan/File-Find-Rule-tarball 3 h in 2 h 58 min 0
1257 delta/cpan/File-Listing-tarball 3 h in 2 h 58 min 0
1258 delta/cpan/File-HomeDir-tarball 3 h in 2 h 58 min 0
1259 delta/cpan/File-Slurp-tarball 3 h in 2 h 58 min 0
1260 delta/cpan/File-Spec-Native-tarball 3 h in 2 h 58 min 0
1261 delta/cpan/File-Which-tarball 3 h in 2 h 58 min 0
1262 delta/cpan/Future-tarball 3 h in 2 h 58 min 0
1263 delta/cpan/HTML-Parser-tarball 3 h in 2 h 58 min 0
1264 delta/cpan/HTML-Tagset-tarball 3 h in 2 h 58 min 0
1265 delta/cpan/HTTP-Cookies-tarball 3 h in 2 h 58 min 0
1266 delta/cpan/HTTP-Daemon-tarball 3 h in 2 h 58 min 0
1267 delta/cpan/HTTP-Date-tarball 3 h in 2 h 58 min 0
1268 delta/cpan/HTTP-Message-tarball 3 h in 2 h 59 min 0
1269 delta/cpan/HTTP-Negotiate-tarball 3 h in 2 h 59 min 0
1270 delta/cpan/HTTP-Server-Simple-tarball 3 h in 2 h 59 min 0
1271 delta/cpan/IO-Async-tarball 3 h in 2 h 59 min 0
1272 delta/cpan/JSON-tarball 3 h in 2 h 59 min 0
1273 delta/cpan/Log-Dispatch-tarball 3 h in 2 h 59 min 0
1274 delta/cpan/IO-HTML-tarball 3 h in 2 h 59 min 0
1275 delta/cpan/LWP-MediaTypes-tarball 3 h in 2 h 59 min 0
1276 delta/cpan/List-MoreUtils-tarball 3 h in 2 h 59 min 0
1277 delta/cpan/Log-Log4perl-tarball 3 h in 2 h 59 min 0
1278 delta/cpan/Module-Build-Tiny-tarball 3 h in 2 h 59 min 0
1279 delta/cpan/Module-Build-tarball 3 h in 2 h 59 min 0
1280 delta/cpan/MRO-Compat-tarball 3 h in 2 h 59 min 0
1281 delta/cpan/Module-CPANfile-tarball 3 h in 2 h 59 min 0
1282 delta/cpan/Module-Implementation-tarball 3 h in 2 h 59 min 0
1283 delta/cpan/Module-Reader-tarball 3 h in 2 h 59 min 0
1284 delta/cpan/Module-Runtime-Conflicts-tarball 3 h in 2 h 59 min 0
1285 delta/cpan/Module-Runtime-tarball 3 h in 2 h 59 min 0
1286 delta/cpan/Moose-tarball 3 h in 2 h 59 min 0
1287 delta/cpan/Net-HTTP-tarball 3 h in 2 h 59 min 0
1288 delta/cpan/Number-Compare-tarball 3 h in 2 h 59 min 0
1289 delta/cpan/Package-DeprecationManager-tarball 3 h in 2 h 59 min 0
1290 delta/cpan/Package-Stash-XS-tarball 3 h in 2 h 59 min 0
1291 delta/cpan/Package-Stash-tarball 3 h in 2 h 59 min 0
1292 delta/cpan/Params-Util-tarball 3 h in 2 h 59 min 0
1293 delta/cpan/Params-Validate-tarball 3 h in 2 h 59 min 0
1294 delta/cpan/Path-Class-tarball 3 h in 2 h 59 min 0
1295 delta/cpan/Sub-Exporter-Progressive-tarball 3 h in 2 h 59 min 0
1296 delta/cpan/Path-Tiny-tarball 3 h in 2 h 59 min 0
1297 delta/cpan/Sub-Identify-tarball 3 h in 2 h 59 min 0
1298 delta/cpan/Struct-Dumb-tarball 3 h in 2 h 59 min 0
1299 delta/cpan/Sub-Install-tarball 3 h in 2 h 59 min 0
1300 delta/cpan/Sub-Name-tarball 3 h in 2 h 59 min 0
1301 delta/cpan/Task-Weaken-tarball 3 h in 2 h 59 min 0
1302 delta/cpan/Test-Requires-tarball 3 h in 2 h 59 min 0
1303 delta/cpan/Sub-Exporter-tarball 3 h in 2 h 59 min 0
1304 delta/cpan/Text-Glob-tarball 3 h in 2 h 59 min 0
1305 delta/cpan/Try-Tiny-tarball 3 h in 2 h 59 min 0
1306 delta/cpan/Test-Fatal-tarball 3 h in 2 h 59 min 0
1307 delta/cpan/URI-tarball 3 h in 2 h 59 min 0
1308 delta/cpan/WWW-RobotRules-tarball 3 h in 2 h 59 min 0
1309 delta/cpan/libwww-perl-tarball 3 h in 2 h 59 min 0
1310 delta/cpan/YAML-tarball 3 h in 2 h 59 min 0
1311 delta/cramfs-tarball 3 h in 2 h 59 min 0
1312 delta/diffutils-tarball 3 h in 2 h 59 min 0
1313 delta/docbook-xml 3 h in 2 h 59 min 0
1314 delta/qt5/qtdeclarative-testsuites 3 h in 2 h 59 min 0
1315 delta/cvs-tarball 3 h in 2 h 59 min 0
1316 delta/docbook-xsl 3 h in 2 h 59 min 0
1317 delta/c2man 3 h in 2 h 59 min 0
1318 delta/dev86 3 h in 2 h 59 min 0
1319 delta/cvsps 3 h in 2 h 59 min 0
1320 delta/device-tree-compiler 3 h in 2 h 59 min 0
1321 delta/dbus-c++ 3 h in 2 h 59 min 0
1322 delta/dleyna/dleyna-core 3 h in 2 h 59 min 0
1323 delta/dleyna/dleyna-connector-dbus 3 h in 2 h 59 min 0
1324 delta/editline-tarball 3 h in 2 h 59 min 0
1325 delta/colord 3 h in 2 h 59 min 0
1326 delta/error-perl-tarball 3 h in 2 h 59 min 0
1327 delta/qt5/qt3d 3 h in 2 h 59 min 0
1328 delta/ebtables 3 h in 2 h 59 min 0
1329 delta/freefont-otf 3 h in 2 h 59 min 0
1330 delta/findutils-tarball 3 h in 2 h 59 min 0
1331 delta/ca-certificates 3 h in 2 h 59 min 0
1332 delta/cgit 3 h in 2 h 59 min 0
1333 delta/connman 3 h in 2 h 59 min 0
1334 delta/cracklib 3 h in 2 h 59 min 0
1335 delta/distcc-git 3 h in 2 h 59 min 0
1336 delta/gdbm-tarball 3 h in 2 h 59 min 0
1337 delta/dleyna/dleyna-renderer 3 h in 2 h 59 min 0
1338 delta/dleyna/dleyna-control 3 h in 2 h 59 min 0
1339 delta/colm 3 h in 2 h 59 min 0
1340 delta/cherrypy-git 3 h in 2 h 59 min 0
1341 delta/automotive-message-broker 3 h in 2 h 59 min 0
1342 delta/coreboot/blobs 3 h in 2 h 59 min 0
1343 delta/dbus-glib 3 h in 2 h 59 min 0
1344 delta/devil 3 h in 2 h 59 min 0
1345 delta/dbus-python 3 h in 2 h 59 min 0
1346 delta/dconf 3 h in 2 h 59 min 0
1347 delta/dleyna/dleyna-server 3 h in 2 h 59 min 0
1348 delta/enchant 3 h in 2 h 59 min 0
1349 delta/glew-tarball 3 h in 2 h 59 min 0
1350 delta/erlang-modules/erlang-sd_notify 3 h in 2 h 59 min 0
1351 delta/dmidecode-git 3 h in 2 h 59 min 0
1352 delta/docker-py 3 h in 2 h 59 min 0
1353 delta/VirtualBox 3 h in 2 h 59 min 0
1354 delta/diffutils 3 h in 2 h 59 min 0
1355 delta/bluez 3 h in 2 h 59 min 0
1356 delta/dnsmasq 3 h in 2 h 59 min 0
1357 delta/cryptopp-git 3 h in 2 h 59 min 0
1358 delta/eet 3 h in 2 h 59 min 0
1359 delta/eina 3 h in 2 h 59 min 0

Updated: 2021-09-21 08:42:07 UTC