adms
issued: 2023-04-05
license: https://creativecommons.org/licenses/by/4.0/
mediator: Semantic Interoperability Community (SEMIC)
type: Ontology
editor: Person
  first name: Bert
  last name: Van Nuffelen
  affiliation: TenForce
editor: Person
  first name: Natasa
  last name: Sofou
editor: Person
  first name: Pavlina
  last name: Fragkou
  affiliation: SEMIC EU
editor: Person
  first name: Makx
  last name: Dekkers
maker: Person
  first name: Pavlina
  last name: Fragkou
  affiliation: SEMIC EU

Asset
type: Class
comment: An abstract entity that reflects the intellectual content of the asset and represents those characteristics of the asset that are independent of its physical embodiment. This abstract entity combines the FRBR entities work (a distinct intellectual or artistic creation) and expression (the intellectual or artistic realization of a work)

Asset Distribution
type: Class
comment: A particular physical embodiment of an Asset, which is an example of the FRBR entity manifestation (the physical embodiment of an expression of a work).

Asset repository
type: Class
comment: A system or service that provides facilities for storage and maintenance of descriptions of Assets and Asset Distributions, and functionality that allows users to search and access these descriptions. An Asset Repository will typically contain descriptions of several Assets and related Asset Distributions.

Identifier
type: Class
comment: This is based on the UN/CEFACT Identifier class.

identifier
type: ObjectProperty
comment: Links a resource to an adms:Identifier class.
domain: Resource
range: Identifier

included asset
type: ObjectProperty
comment: An Asset that is contained in the Asset being described, e.g. when there are several vocabularies defined in a single document.
domain: Asset
range: Asset

interoperability level
type: ObjectProperty
comment: The interoperability level for which the Asset is relevant.
domain: Asset
range: Concept

last
type: ObjectProperty
comment: A link to the current or latest version of the Asset.
domain: Resource
range: Resource
sub property of: last

next
type: ObjectProperty
comment: A link to the next version of the Asset.
domain: Resource
range: Resource
sub property of: next

prev
type: ObjectProperty
comment: A link to the previous version of the Asset.
domain: Resource
range: Resource
sub property of: prev

representation technique
type: ObjectProperty
comment: More information about the format in which an Asset Distribution is released. This is different from the file format as, for example, a ZIP file (file format) could contain an XML schema (representation technique).
domain: Resource
range: Concept

sample
type: ObjectProperty
comment: Links to a sample of an Asset (which is itself an Asset).
domain: Resource
range: Resource

schema agency
type: DatatypeProperty
comment: The name of the agency that issued the identifier.
domain: Identifier
range: Literal

status
type: ObjectProperty
comment: The status of the Asset in the context of a particular workflow process.
domain: Resource
range: Concept

supported schema
type: ObjectProperty
comment: A schema according to which the Asset Repository can provide data about its content, e.g. ADMS.
domain: Resource
range: Asset

translation
type: ObjectProperty
comment: Links Assets that are translations of each other.
domain: Resource
range: Resource

version notes
type: DatatypeProperty
comment: A description of changes between this version and the previous version of the Asset.
domain: Resource
range: Literal